Cyclobutene, hexafluoro-
- Formula: C4F6
- Molecular weight: 162.0332
- IUPAC Standard InChIKey: QVHWOZCZUNPZPW-UHFFFAOYSA-N
- CAS Registry Number: 697-11-0
- Chemical structure:
View 3d structure (requires JavaScript / HTML 5) - Other names: Hexafluorocyclobutene; Perfluorocyclobutene; 1,2,3,3,4,4-Hexafluorocyclobutene

Gas phase thermochemistry data

Data compiled by: Hussein Y. Afeefy, Joel F. Liebman, and Stephen E. Stein
Quantity | Value | Units | Method | Reference | Comment |
---|---|---|---|---|---|
ΔfH°gas | Cm | Andreevskii and Antonova, 1982 | uncertain value: -991.2 kJ/mol |

Phase change data

Data compiled as indicated in comments:
BS - Robert L. Brown and Stephen E. Stein
TRC - Thermodynamics Research Center, NIST Boulder Laboratories, Chris Muzny director
Quantity | Value | Units | Method | Reference | Comment |
---|---|---|---|---|---|
Tboil | 278. to 279. | K | N/A | PCR Inc., 1990 | BS |
Tboil | 278. | K | N/A | Park, Benning, et al., 1947 | Uncertainty assigned by TRC = 3. K; TRC |

Reaction thermochemistry data

Data compiled by: Hussein Y. Afeefy, Joel F. Liebman, and Stephen E. Stein
Individual Reactions
By formula: C4F6 + Cl2 = C4Cl2F6
Quantity | Value | Units | Method | Reference | Comment |
---|---|---|---|---|---|
ΔrH° | -156.4 ± 4.1 | kJ/mol | Cm | Lacher, McKinley, et al., 1949 | gas phase; Heat of chlorination at 363 °K |

Gas phase ion energetics data

Data compiled by: John E. Bartmess
Electron affinity determinations
EA (eV) | Method | Reference | Comment |
---|---|---|---|
0.23699 | Kine | Christophorou and Datkos, 1995 |

References

Andreevskii and Antonova, 1982
Andreevskii, D.N.; Antonova, Z.A.,
Development of an increment scheme for calculating the thermodynamic properties of organic polyfluoro compounds,
J. Appl. Chem. USSR, 1982, 55, 582-587. [all data]
PCR Inc., 1990
PCR Inc.,
Research Chemicals Catalog 1990-1991, PCR Inc., Gainesville, FL, 1990, 1. [all data]
Park, Benning, et al., 1947
Park, J.D.; Benning, A.F.; Downing, F.B.; Laucius, J.F.; McHarness, R.C.,
Synthesis of Tetrafluoroethylene. Pyrolysis of Monochlorodifluoromethane,
Ind. Eng. Chem., 1947, 39, 343-8. [all data]
Lacher, McKinley, et al., 1949
Lacher, J.R.; McKinley, J.J.; Walden, C.; Lea, K.; Park, J.D.,
Reaction heats of organic fluorine compounds. II. The vapor phase heats of chlorination of some simple fluoroolefins,
J. Am. Chem. Soc., 1949, 71, 1334-1337. [all data]
Christophorou and Datkos, 1995
Christophorou, L.G.; Datkos, P.G.,
Effect of Temperature on the Formation and Autodestruction of Parent Anions,
Int. J. Mass Spectrom. Ion Proc., 1995, 149/150, 59, https://doi.org/10.1016/0168-1176(95)04229-E
. [all data]