2H-Pyran-2-one, 5,6-dihydro-4,6,6-trimethyl-
- Formula: C8H12O2
- Molecular weight: 140.1797
- IUPAC Standard InChIKey: ZSQHRLJAKWRVJQ-UHFFFAOYSA-N
- CAS Registry Number: 6970-56-5
- Chemical structure:
View 3d structure (requires JavaScript / HTML 5) - Permanent link for this species. Use this link for bookmarking this species for future reference.

Normal alkane RI, polar column, temperature ramp

Column type | Active phase | I | Reference | Comment |
---|---|---|---|---|
Capillary | Carbowax 20M | 1905. | Vernin, Lageot, et al., 2001 | 50. m/0.22 mm/0.25 μm, He, 2. K/min; Tstart: 60. C; Tend: 220. C |

Phase change data

Data compiled by: Thermodynamics Research Center, NIST Boulder Laboratories, Chris Muzny director
Quantity | Value | Units | Method | Reference | Comment |
---|---|---|---|---|---|
Tfus | 298.6 | K | N/A | Anonymous, 1953 | Uncertainty assigned by TRC = 0.6 K |

References

Vernin, Lageot, et al., 2001
Vernin, G.; Lageot, C.; Gaydou, E.M.; Parkanyi, C.,
Analysis of the essential oil of Lippia graveolens HBK from El Salvador,
Flavour Fragr. J., 2001, 16, 3, 219-226, https://doi.org/10.1002/ffj.984
. [all data]