(1R-trans)-1,3-dimethylcyclohexane
- Formula: C8H16
- Molecular weight: 112.2126
- IUPAC Standard InChIKey: SGVUHPSBDNVHKL-YUMQZZPRSA-N
- CAS Registry Number: 69685-68-3
- Chemical structure:
View 3d structure (requires JavaScript / HTML 5) - Species with the same structure:
- Stereoisomers:

Phase change data

Data compiled by: Thermodynamics Research Center, NIST Boulder Laboratories, Chris Muzny director
Quantity | Value | Units | Method | Reference | Comment |
---|---|---|---|---|---|
Tboil | 397. ± 1. | K | AVG | N/A | Average of 8 values; Individual data points |

References

No reference data available.