Cyclooctyl alcohol
- Formula: C8H16O
- Molecular weight: 128.2120
- IUPAC Standard InChIKey: FHADSMKORVFYOS-UHFFFAOYSA-N
- CAS Registry Number: 696-71-9
- Chemical structure:
View 3d structure (requires JavaScript / HTML 5) - Other names: Cyclooctanol

Phase change data

Data compiled as indicated in comments:
BS - Robert L. Brown and Stephen E. Stein
AC - William E. Acree, Jr., James S. Chickos
CAL - James S. Chickos, William E. Acree, Jr., Joel F. Liebman, Students of Chem 202 (Introduction to the Literature of Chemistry), University of Missouri -- St. Louis
Reduced pressure boiling point
Tboil (K) | Pressure (bar) | Reference | Comment |
---|---|---|---|
380.2 | 0.029 | Aldrich Chemical Company Inc., 1990 | BS |
Enthalpy of fusion
ΔfusH (kJ/mol) | Temperature (K) | Method | Reference | Comment |
---|---|---|---|---|
2.02 | 291.2 | DSC | Singh and Murthy, 2008 | AC |
1.97 | 297.1 | N/A | Rute, Salud, et al., 2003 | AC |
2.06 | 295. | N/A | Sciesinski, Mayer, et al., 1995 | Authors did not report enthalpic data for all transitions; AC |
Entropy of fusion
ΔfusS (J/mol*K) | Temperature (K) | Reference | Comment |
---|---|---|---|
8.11 | 261.3 | Sciesinski, Mayer, et al., 1995, 2 | CAL |
6.98 | 295.0 |

Reaction thermochemistry data

Data compiled by: Hussein Y. Afeefy, Joel F. Liebman, and Stephen E. Stein
Individual Reactions
By formula: H2 + C8H14O = C8H16O
Quantity | Value | Units | Method | Reference | Comment |
---|---|---|---|---|---|
ΔrH° | -55.73 | kJ/mol | Chyd | Wiberg, Crocker, et al., 1991 | liquid phase |
ΔrH° | -53.14 | kJ/mol | Chyd | Wiberg, Crocker, et al., 1991 | solid phase |
ΔrH° | -39.0 | kJ/mol | Chyd | Wiberg, Crocker, et al., 1991 | gas phase |
ΔrH° | -53.14 ± 0.59 | kJ/mol | Cm | Wiberg, Crocker, et al., 1991 | solid phase |

Kovats' RI, non-polar column, isothermal

View large format table.

Column type Active phase Temperature (C) I Reference Comment
CapillaryOV-101150.1131.4Cha and Lee, 1994Column length: 20. m; Column diameter: 0.5 mm
CapillaryOV-101180.1147.3Cha and Lee, 1994Column length: 20. m; Column diameter: 0.5 mm
PackedApiezon L130.1155.Wehrli and Kováts, 1959Celite; Column length: 2.25 m

Van Den Dool and Kratz RI, polar column, custom temperature program

View large format table.

Column type Active phase I Reference Comment
CapillaryDB-Wax1640.8Yang, Chyau, et al., 1998He; Column length: 50. m; Column diameter: 0.32 mm; Program: 50C => 2.5C/min => 150C => 1.5C/min => 210C

Normal alkane RI, non-polar column, custom temperature program

View large format table.

Column type Active phase I Reference Comment
CapillarySE-301133.Vinogradov, 2004Program: not specified

Normal alkane RI, polar column, custom temperature program

View large format table.

Column type Active phase I Reference Comment
CapillaryCarbowax 20M1700.Vinogradov, 2004Program: not specified

References

Aldrich Chemical Company Inc., 1990
Aldrich Chemical Company Inc.,
Catalog Handbook of Fine Chemicals, Aldrich Chemical Company, Inc., Milwaukee WI, 1990, 1. [all data]
Singh and Murthy, 2008
Singh, L.P.; Murthy, S.S.N.,
Dielectric and Calorimetric Study of Orientationally Disordered Phases in Two Unusual Two-Component Systems,
J. Phys. Chem. B, 2008, 112, 9, 2606-2615, https://doi.org/10.1021/jp077663o
. [all data]
Rute, Salud, et al., 2003
Rute, M.A.; Salud, J.; Negrier, P.; López, D.O.; Tamarit, J.Ll.; Puertas, R.; Barrio, M.; Mondieig, D.,
Two-Component System Cycloheptanol (C7) + Cyclooctanol (C8): An Extraordinary System,
J. Phys. Chem. B, 2003, 107, 24, 5914-5921, https://doi.org/10.1021/jp022193d
. [all data]
Sciesinski, Mayer, et al., 1995
Sciesinski, J.; Mayer, J.; Wasiutynski, T.; Sciesinska, E.; Wójtowicz, J.,
Calorimetric study of cyclooctanol,
Phase Transitions, 1995, 54, 1, 15-21, https://doi.org/10.1080/01411599508200401
. [all data]
Sciesinski, Mayer, et al., 1995, 2
Sciesinski, J.; Mayer, J.; Wasiutynski, T.; Sciesinska, E.; Wojtowicz, J.,
Calorimetric study of cyclooctanol,
Phase Trans., 1995, 54, 1, 15, https://doi.org/10.1080/01411599508200401
. [all data]
Wiberg, Crocker, et al., 1991
Wiberg, K.B.; Crocker, L.S.; Morgan, K.M.,
Thermochemical studies of carbonyl compounds. 5. Enthalpies of reduction of carbonyl groups,
J. Am. Chem. Soc., 1991, 113, 3447-3450. [all data]