CAS Reg. No. 69670-04-8
- CAS Registry Number: 69670-04-8

Reaction thermochemistry data

Data compiled by: John E. Bartmess
Individual Reactions
(CAS Reg. No. 69670-04-8 • 4294967295) +
= CAS Reg. No. 69670-04-8
By formula: (CAS Reg. No. 69670-04-8 • 4294967295Cu) + Cu = CAS Reg. No. 69670-04-8
Quantity | Value | Units | Method | Reference | Comment |
---|---|---|---|---|---|
ΔrH° | 233. ± 15. | kJ/mol | N/A | Spasov, Lee, et al., 2000 | gas phase; 0 K dissociation energy |
ΔrH° | 250. ± 42. | kJ/mol | N/A | Ho, Ervin, et al., 1990 | gas phase; Vertical Detachment Energy: 2.37±0.01 eV. |

References

Spasov, Lee, et al., 2000
Spasov, V.A.; Lee, T.H.; Ervin, K.M.,
Threshold collision-induced dissociation of anionic copper clusters and copper cluster monocarbonyls,
J. Chem. Phys., 2000, 112, 4, 1713-1720, https://doi.org/10.1063/1.480736
. [all data]
Ho, Ervin, et al., 1990
Ho, J.; Ervin, K.M.; Lineberger, W.C.,
Photoelectron Spectroscopy of Metal Cluster Anions - Cun-, Agn-, and Aun-,
J. Chem. Phys., 1990, 93, 10, 6987, https://doi.org/10.1063/1.459475
. [all data]