Benzenethiol, 4-methoxy-
- Formula: C7H8OS
- Molecular weight: 140.203
- IUPAC Standard InChIKey: NIFAOMSJMGEFTQ-UHFFFAOYSA-N
- CAS Registry Number: 696-63-9
- Chemical structure:
View 3d structure (requires JavaScript / HTML 5) - Other names: para-Methoxybenzenethiol; 4-Methoxythiophenol; p-Methoxy thiophenol; 4-Methoxybenzenethiol; p-Methoxybenzenethiol; Benzenethiol, p-methoxy-

Phase change data

Data compiled by: Robert L. Brown and Stephen E. Stein
Quantity | Value | Units | Method | Reference | Comment |
---|---|---|---|---|---|
Tboil | 501.2 | K | N/A | Weast and Grasselli, 1989 |
Reduced pressure boiling point
Tboil (K) | Pressure (bar) | Reference |
---|---|---|
374.7 | 0.017 | Aldrich Chemical Company Inc., 1990 |
362.7 | 0.007 | Weast and Grasselli, 1989 |

Van Den Dool and Kratz RI, non-polar column, custom temperature program

Column type | Active phase | I | Reference | Comment |
---|---|---|---|---|
Capillary | VF-5MS | 1249.5 | Tret'yakov, 2008 | 30. m/0.25 mm/0.25 μm, He; Program: Multi-step temperature program; T(initial)=60C; T(final)=270C |

References

Weast and Grasselli, 1989
CRC Handbook of Data on Organic Compounds, 2nd Editon, Weast,R.C and Grasselli, J.G., ed(s)., CRC Press, Inc., Boca Raton, FL, 1989, 1. [all data]
Aldrich Chemical Company Inc., 1990
Aldrich Chemical Company Inc.,
Catalog Handbook of Fine Chemicals, Aldrich Chemical Company, Inc., Milwaukee WI, 1990, 1. [all data]
Tret'yakov, 2008
Tret'yakov, K.V.,
Retention Data. NIST Mass Spectrometry Data Center., NIST Mass Spectrometry Data Center, 2008. [all data]