1,5-Diacetoxypentane
- Formula: C9H16O4
- Molecular weight: 188.2209
- IUPAC Standard InChIKey: PIJBVCVBCQOWMM-UHFFFAOYSA-N
- CAS Registry Number: 6963-44-6
- Chemical structure:
View 3d structure (requires JavaScript / HTML 5) - Species with the same structure:
- Other names: 1,5-Pentanediol diacetate; Pentamethylene acetate; pentane-1,5-diyl diacetate

Phase change data

Data compiled by: Robert L. Brown and Stephen E. Stein
Quantity | Value | Units | Method | Reference | Comment |
---|---|---|---|---|---|
Tboil | 517. | K | N/A | Frinton Laboratories Inc., 1986 |
Reduced pressure boiling point
Tboil (K) | Pressure (bar) | Reference |
---|---|---|
395.7 | 0.004 | Weast and Grasselli, 1989 |

References

Frinton Laboratories Inc., 1986
Frinton Laboratories Inc.,
Catalog Number 11, Frinton Laboratories Inc., Vineland, NJ, 1986, 99. [all data]
Weast and Grasselli, 1989
CRC Handbook of Data on Organic Compounds, 2nd Editon, Weast,R.C and Grasselli, J.G., ed(s)., CRC Press, Inc., Boca Raton, FL, 1989, 1. [all data]