2-Aminophenol, TBDMS derivative

Van Den Dool and Kratz RI, non-polar column, temperature ramp

Data compiled by: NIST Mass Spectrometry Data Center, William E. Wallace, director

Column type CapillaryCapillary
Active phase VF-5MSVF-5MS
Column length (m) 30.30.
Carrier gas HeHe
Substrate
Column diameter (mm) 0.250.25
Phase thickness (μm) 0.250.25
Tstart (C) 60.60.
Tend (C) 270.270.
Heat rate (K/min)
Initial hold (min)
Final hold (min)
I 1543.1537.
ReferenceTodua, 2011N/A
Comment MSDC-RI MSDC-RI

References

Todua, 2011
Todua, N.G., Retention Data. NIST Mass Spectrometry Data Center., NIST Mass Spectrometry Data Center, 2011. [all data]