m-Terephthalanisidide
- Formula: C22H20N2O4
- Molecular weight: 376.4052
- IUPAC Standard InChIKey: BTEAFZRBSOWUOB-UHFFFAOYSA-N
- CAS Registry Number: 6957-81-9
- Chemical structure:
View 3d structure (requires JavaScript / HTML 5) - Other names: 3,3'-Dimethoxy terephthalanilide; 3',3''-3,3'-Dimethoxy terephthalanilide; N,N'-Bis-(m-methoxyphenyl)terphtalamide

Gas phase thermochemistry data

Data compiled by: Hussein Y. Afeefy, Joel F. Liebman, and Stephen E. Stein
Quantity | Value | Units | Method | Reference | Comment |
---|---|---|---|---|---|
ΔfH°gas | -340. ± 8.8 | kJ/mol | Ccb | Hamilton, Mitchell, et al., 1973 | Heat of combustion from table not from abstract |

Condensed phase thermochemistry data

Data compiled as indicated in comments:
ALS - Hussein Y. Afeefy, Joel F. Liebman, and Stephen E. Stein
DH - Eugene S. Domalski and Elizabeth D. Hearing
Quantity | Value | Units | Method | Reference | Comment |
---|---|---|---|---|---|
ΔfH°solid | -549.2 ± 3.2 | kJ/mol | Ccb | Hamilton, Mitchell, et al., 1973 | Heat of combustion from table not from abstract; ALS |
Quantity | Value | Units | Method | Reference | Comment |
ΔcH°solid | -10966.3 ± 3.0 | kJ/mol | Ccb | Hamilton, Mitchell, et al., 1973 | Heat of combustion from table not from abstract; ALS |
Constant pressure heat capacity of solid
Cp,solid (J/mol*K) | Temperature (K) | Reference | Comment |
---|---|---|---|
458.1 | 298.15 | Hamilton, Mitchell, et al., 1973 | DH |

Phase change data

Data compiled as indicated in comments:
ALS - Hussein Y. Afeefy, Joel F. Liebman, and Stephen E. Stein
AC - William E. Acree, Jr., James S. Chickos
Quantity | Value | Units | Method | Reference | Comment |
---|---|---|---|---|---|
ΔsubH° | 209. ± 8.4 | kJ/mol | E | Hamilton, Mitchell, et al., 1973 | Heat of combustion from table not from abstract; ALS |
Enthalpy of sublimation
ΔsubH (kJ/mol) | Temperature (K) | Method | Reference | Comment |
---|---|---|---|---|
209.2 ± 8.4 | 183. to 197. | ME | Hamilton, Mitchell, et al., 1973 | See also Pedley and Rylance, 1977.; AC |

References

Hamilton, Mitchell, et al., 1973
Hamilton, W.S.; Mitchell, G.M.; Ayers, D.A.,
Heat of combustion of N,N'-bis(m-methoxyphenyl)terephthalamide and NN'-bis(p-methoxyphenyl)terephthalamide,
J. Chem. Eng. Data, 1973, 18, 364-366. [all data]
Pedley and Rylance, 1977
Pedley, J.B.; Rylance, J.,
, Computer Analysed Thermochemical Data: Organic and Organometallic Compounds, University of Sussex, Brighton, 1977. [all data]