2-Mercapto-4,5-dimethyl-1,3,2-dioxaphospholane-2-sulfide

Phase change data

Data compiled by: William E. Acree, Jr., James S. Chickos

Quantity Value Units Method Reference Comment
Δvap66.kJ/molN/ASagadeev and Safina, 2008

References

Sagadeev and Safina, 2008
Sagadeev, E.V.; Safina, Yu.G., Thermochemistry of dithiophosphoric acid derivatives, Russ J Gen Chem, 2008, 78, 1, 65-68, https://doi.org/10.1134/S107036320801012X . [all data]