Dimethadione
- Formula: C5H7NO3
- Molecular weight: 129.1140
- IUPAC Standard InChIKey: JYJFNDQBESEHJQ-UHFFFAOYSA-N
- CAS Registry Number: 695-53-4
- Chemical structure:
View 3d structure (requires JavaScript / HTML 5) - Other names: 2,4-Oxazolidinedione, 5,5-dimethyl-; AC 1198; Bay 1400Z; Dimethadion; DMO; Eupractone; 5,5-Dimethyl-2,4-oxazolidinedione; 5,5-Dimethyloxazolidine-2,4-dione; 5,5-Dimethyloxazolidinedione; Bax 1400Z; Dimethyloxazolidinedione; Propazone; 5,5-Dwumetylooksazolidyno-2,4-dion; NSC-30152; Trimethadion, M(nor-)

Kovats' RI, non-polar column, temperature ramp

Column type | Active phase | I | Reference | Comment |
---|---|---|---|---|
Packed | OV-101 | 1060. | Maurer, 1990 | N2, Chromosorb G HP, 100. C @ 3. min, 30. K/min, 310. C @ 5. min; Column length: 0.6 m |

References

Maurer, 1990
Maurer, H.H.,
Detection of anticonvulsants and their metabolites in urine within a general unknown analysis procedure using computerized gas chromatography-mass spectrometry,
Arch. Toxicol., 1990, 64, 7, 554-561, https://doi.org/10.1007/BF01971834
. [all data]