1-(2-Bromoethoxy)-2,4-dichlorobenzene
- Formula: C8H7BrCl2O
- Molecular weight: 269.951
- IUPAC Standard InChIKey: OEYZGSRLAGSENP-UHFFFAOYSA-N
- CAS Registry Number: 6954-77-4
- Chemical structure:
View 3d structure (requires JavaScript / HTML 5) - Permanent link for this species. Use this link for bookmarking this species for future reference.

Phase change data

Data compiled by: Robert L. Brown and Stephen E. Stein
Reduced pressure boiling point
Tboil (K) | Pressure (bar) | Reference |
---|---|---|
445. to 448. | 0.024 | Frinton Laboratories Inc., 1986 |

References

Frinton Laboratories Inc., 1986
Frinton Laboratories Inc.,
Catalog Number 11, Frinton Laboratories Inc., Vineland, NJ, 1986, 99. [all data]