cyclopropanecarbohydrazide
- Formula: C4H8N2O
- Molecular weight: 100.1191
- IUPAC Standard InChIKey: JFYKIEHOOZWARC-UHFFFAOYSA-N
- CAS Registry Number: 6952-93-8
- Chemical structure:
View 3d structure (requires JavaScript / HTML 5) - Other names: cyclopropanecarboxylic acid, hydrazide

Phase change data

Data compiled by: Thermodynamics Research Center, NIST Boulder Laboratories, Chris Muzny director
Quantity | Value | Units | Method | Reference | Comment |
---|---|---|---|---|---|
Tfus | 418.15 | K | N/A | Popp, 1964 | Uncertainty assigned by TRC = 2.5 K |

References

Popp, 1964
Popp, F.D.,
Some Derivatives of 3-Bromobenzaldehyde,
J. Chem. Eng. Data, 1964, 9, 381. [all data]