3,3-Dimethylcyclohexene
- Formula: C8H14
- Molecular weight: 110.1968
- IUPAC Standard InChIKey: BWYHTITWPWGSHN-UHFFFAOYSA-N
- CAS Registry Number: 695-28-3
- Chemical structure:
View 3d structure (requires JavaScript / HTML 5) - Permanent link for this species. Use this link for bookmarking this species for future reference.

Reaction thermochemistry data

Data compiled by: Hussein Y. Afeefy, Joel F. Liebman, and Stephen E. Stein
Individual Reactions
By formula: H2 + C8H14 = C8H16
Quantity | Value | Units | Method | Reference | Comment |
---|---|---|---|---|---|
ΔrH° | -115.7 ± 0.67 | kJ/mol | Chyd | Turner, Jarrett, et al., 1973 | liquid phase; solvent: Acetic acid |
By formula: C8H14 = C8H14
Quantity | Value | Units | Method | Reference | Comment |
---|---|---|---|---|---|
ΔrH° | -2. ± 3. | kJ/mol | Kin | Hoboken, Wiering, et al., 1975 | gas phase |

References

Turner, Jarrett, et al., 1973
Turner, R.B.; Jarrett, A.D.; Goebel, P.; Mallon, B.J.,
Heats of hydrogenation. 9. Cyclic acetylenes and some miscellaneous olefins,
J. Am. Chem. Soc., 1973, 95, 790-792. [all data]
Hoboken, Wiering, et al., 1975
Hoboken, N.J.; Wiering, P.G.; Steinberg, H.,
The effect of pressure on the base-catalysed isomerizations of gem-dimethyl- and isopropyl-cyclohexenes. Part 6,
J. R. Neth. Chem. Soc., 1975, 94, 243-245. [all data]