Methylammonium triiodoplumbate(II)

Phase change data

Data compiled by: Eugene S. Domalski and Elizabeth D. Hearing

Enthalpy of phase transition

ΔHtrs (kJ/mol) Temperature (K) Initial Phase Final Phase Reference Comment
2.980161.4crystaline, IIIcrystaline, IIOnoda-Yamamuro, Matsuo, et al., 1990
2.580330.4crystaline, IIcrystaline, IOnoda-Yamamuro, Matsuo, et al., 1990

Entropy of phase transition

ΔStrs (J/mol*K) Temperature (K) Initial Phase Final Phase Reference Comment
19.0161.4crystaline, IIIcrystaline, IIOnoda-Yamamuro, Matsuo, et al., 1990
9.7330.4crystaline, IIcrystaline, IOnoda-Yamamuro, Matsuo, et al., 1990

Condensed phase thermochemistry data

Data compiled by: Eugene S. Domalski and Elizabeth D. Hearing

Constant pressure heat capacity of solid

Cp,solid (J/mol*K) Temperature (K) Reference Comment
189.6299.14Onoda-Yamamuro, Matsuo, et al., 1990T = 13 to 365 K. Unsmoothed experimental datum.

References

Onoda-Yamamuro, Matsuo, et al., 1990
Onoda-Yamamuro, N.; Matsuo, T.; Suga, H., Calorimetric and IR spectroscopic studies of phase transitions in methylammonium trihalogenoplumbates(II), J. Phys. Chem. Solids, 1990, 51(12), 1383-1395. [all data]