1,2-Cyclohexanediamine
- Formula: C6H14N2
- Molecular weight: 114.1888
- IUPAC Standard InChIKey: SSJXIUAHEKJCMH-UHFFFAOYSA-N
- CAS Registry Number: 694-83-7
- Chemical structure:
- Other names: 1,2-Diaminocyclohexane; 1,2-Diaminocyclohexane,c&t; Cyclohexanediamine1,2-cyclohexanediamine; DACH; DCH-99; Diaminocyclohexane; cyclohex-1,2-ylenediamine

Phase change data

Data compiled by: Robert L. Brown and Stephen E. Stein
Reduced pressure boiling point
Tboil (K) | Pressure (atm) | Reference |
---|---|---|
365.2 | 0.024 | Aldrich Chemical Company Inc., 1990 |

Normal alkane RI, non-polar column, temperature ramp

Column type | Active phase | I | Reference | Comment |
---|---|---|---|---|
Capillary | OV-101 | 972. | Zenkevich, 2005 | 25. m/0.20 mm/0.10 μm, N2/He, 6. K/min; Tstart: 50. C; Tend: 250. C |

References

Aldrich Chemical Company Inc., 1990
Aldrich Chemical Company Inc.,
Catalog Handbook of Fine Chemicals, Aldrich Chemical Company, Inc., Milwaukee WI, 1990, 1. [all data]
Zenkevich, 2005
Zenkevich, I.G.,
Experimentally measured retention indices., 2005. [all data]