Benzene, 1-bromo-2-chloro-
- Formula: C6H4BrCl
- Molecular weight: 191.453
- IUPAC Standard InChIKey: QBELEDRHMPMKHP-UHFFFAOYSA-N
- CAS Registry Number: 694-80-4
- Chemical structure:
View 3d structure (requires JavaScript / HTML 5) - Other names: o-Bromochlorobenzene; o-Chlorobromobenzene; 1-Bromo-2-chlorobenzene; 1-Chloro-2-bromobenzene; 2-Bromo-1-chlorobenzene; 2-Chlorobromobenzene; 2-Bromochlorobenzene

Condensed phase thermochemistry data

Data compiled by: Eugene S. Domalski and Elizabeth D. Hearing
Constant pressure heat capacity of liquid
Cp,liquid (J/mol*K) | Temperature (K) | Reference | Comment |
---|---|---|---|
176.9 | 298.15 | Narbutt, 1918 | T = 198 to 374 K. Cp = 0.21497 + 0.0002348t cal/g*K. Cp value calculated from equation. |

Phase change data

Data compiled as indicated in comments:
BS - Robert L. Brown and Stephen E. Stein
TRC - Thermodynamics Research Center, NIST Boulder Laboratories, Chris Muzny director
AC - William E. Acree, Jr., James S. Chickos
DH - Eugene S. Domalski and Elizabeth D. Hearing
Quantity | Value | Units | Method | Reference | Comment |
---|---|---|---|---|---|
Tboil | 477.2 | K | N/A | Aldrich Chemical Company Inc., 1990 | BS |
Tboil | 468. | K | N/A | Buckingham and Donaghy, 1982 | BS |
Quantity | Value | Units | Method | Reference | Comment |
Tfus | 261. | K | N/A | Buckingham and Donaghy, 1982 | BS |
Tfus | 260.55 | K | N/A | Narbutt, 1918, 2 | Uncertainty assigned by TRC = 0.2 K; TRC |
Enthalpy of fusion
ΔfusH (kJ/mol) | Temperature (K) | Reference | Comment |
---|---|---|---|
12.37 | 260.6 | Domalski and Hearing, 1996 | AC |
12.368 | 260.55 | Narbutt, 1918 | DH |
Entropy of fusion
ΔfusS (J/mol*K) | Temperature (K) | Reference | Comment |
---|---|---|---|
47.5 | 260.55 | Narbutt, 1918 | DH |

Kovats' RI, non-polar column, isothermal

Column type | Active phase | Temperature (C) | I | Reference | Comment |
---|---|---|---|---|---|
Capillary | DB-5 | 110. | 1137.48 | Gerbino, Garbarino, et al., 1996 | 30. m/0.53 mm/1.5 μm, N2 |
Capillary | DB-5 | 70. | 1111.54 | Gerbino, Garbarino, et al., 1996 | 30. m/0.53 mm/1.5 μm, N2 |
Capillary | DB-5 | 90. | 1123.72 | Gerbino, Garbarino, et al., 1996 | 30. m/0.53 mm/1.5 μm, N2 |

Van Den Dool and Kratz RI, non-polar column, temperature ramp

Column type | Active phase | I | Reference | Comment |
---|---|---|---|---|
Capillary | OV-1 | 1097.6 | Gautzsch and Zinn, 1996 | 8. K/min; Tstart: 35. C; Tend: 300. C |
Capillary | OV-1 | 1097.6 | Gautzsch and Zinn, 1996 | 8. K/min; Tstart: 35. C; Tend: 300. C |
Capillary | DB-5 | 1105.74 | Gerbino, Garbarino, et al., 1996 | 30. m/0.53 mm/1.5 μm, N2, 2. K/min; Tstart: 50. C |
Capillary | DB-5 | 1110.94 | Gerbino, Garbarino, et al., 1996 | 30. m/0.53 mm/1.5 μm, N2, 2. K/min; Tstart: 50. C |
Capillary | DB-5 | 1116.38 | Gerbino, Garbarino, et al., 1996 | 30. m/0.53 mm/1.5 μm, N2, 2. K/min; Tstart: 50. C |
Capillary | DB-1 | 1120. | Gerbino and Castello, 1995 | 30. m/0.235 mm/0.25 μm, N2, 100. C @ 0. min, 10. K/min |
Capillary | DB-1 | 1111. | Gerbino and Castello, 1995 | 30. m/0.235 mm/0.25 μm, N2, 100. C @ 0. min, 5. K/min |
Capillary | DB-1 | 1100. | Gerbino and Castello, 1995 | 30. m/0.235 mm/0.25 μm, N2, 50. C @ 0. min, 10. K/min |
Capillary | DB-1 | 1094. | Gerbino and Castello, 1995 | 30. m/0.235 mm/0.25 μm, N2, 50. C @ 0. min, 5. K/min |

Van Den Dool and Kratz RI, polar column, temperature ramp

Column type | Active phase | I | Reference | Comment |
---|---|---|---|---|
Capillary | DB-Wax | 1665.31 | Gerbino and Castello, 1995 | 30. m/0.235 mm/0.5 μm, N2, 10. K/min; Tstart: 100. C |
Capillary | DB-Wax | 1653.05 | Gerbino and Castello, 1995 | 30. m/0.235 mm/0.5 μm, N2, 5. K/min; Tstart: 100. C |
Capillary | DB-Wax | 1650.41 | Gerbino and Castello, 1995 | 30. m/0.235 mm/0.5 μm, N2, 10. K/min; Tstart: 50. C |
Capillary | DB-Wax | 1633.76 | Gerbino and Castello, 1995 | 30. m/0.235 mm/0.5 μm, N2, 5. K/min; Tstart: 50. C |

Lee's RI, non-polar column, temperature ramp

Column type | Active phase | I | Reference | Comment |
---|---|---|---|---|
Capillary | HP5-MS | 188. | Vrana, Paschke, et al., 2005 | 30. m/0.25 mm/0.25 μm, Helium, 50. C @ 5. min, 5. K/min, 280. C @ 10. min |

References

Narbutt, 1918
Narbutt, J.,
Die Spezifischen Warmen und Schmelzwarmen der dichloro-, chlorbrom-, dibrom-, bromjod-, und dijodbenzole. I,
Z. Elektrochem., 1918, 24, 339-342. [all data]
Aldrich Chemical Company Inc., 1990
Aldrich Chemical Company Inc.,
Catalog Handbook of Fine Chemicals, Aldrich Chemical Company, Inc., Milwaukee WI, 1990, 1. [all data]
Buckingham and Donaghy, 1982
Buckingham, J.; Donaghy, S.M.,
Dictionary of Organic Compounds: Fifth Edition, Chapman and Hall, New York, 1982, 1. [all data]
Narbutt, 1918, 2
Narbutt, J.,
The specific heats and heats of melting of dichlorobenzene, bromochlorobenzene, dibromobenzene, bromiodobenzene and diiodobenzenes: I,
Z. Elektrochem. Angew. Phys. Chem., 1918, 24, 339-42. [all data]
Domalski and Hearing, 1996
Domalski, Eugene S.; Hearing, Elizabeth D.,
Heat Capacities and Entropies of Organic Compounds in the Condensed Phase. Volume III,
J. Phys. Chem. Ref. Data, 1996, 25, 1, 1, https://doi.org/10.1063/1.555985
. [all data]
Gerbino, Garbarino, et al., 1996
Gerbino, T.C.; Garbarino, G.; Petit-Bon, P.,
Programmed temperature retention indices: calculation of linear programmed temperature retention indices of halogenated benzenes from isothermal data,
Ann. Chim. (Rome), 1996, 86, 63-75. [all data]
Gautzsch and Zinn, 1996
Gautzsch, R.; Zinn, P.,
Use of incremental models to estimate the retention indexes of aromatic compounds,
Chromatographia, 1996, 43, 3/4, 163-176, https://doi.org/10.1007/BF02292946
. [all data]
Gerbino and Castello, 1995
Gerbino, T.C.; Castello, G.,
Prediction of programmed temperature retention indices on capillary columns of different polarities,
J. Chromatogr. A, 1995, 699, 1-2, 161-171, https://doi.org/10.1016/0021-9673(95)00024-H
. [all data]
Vrana, Paschke, et al., 2005
Vrana, B.; Paschke, H.; Paschke, A.; Popp, P.; Schuurmann, G.,
Performance of semipermeable membrane devices for sampling of organic contaminants in groun water,
J. Envirom. Monit., 2005, 7, 5, 500-508, https://doi.org/10.1039/b411645c
. [all data]