Pentalene, octahydro-
- Formula: C8H14
- Molecular weight: 110.1968
- IUPAC Standard InChIKey: AEBWATHAIVJLTA-UHFFFAOYSA-N
- CAS Registry Number: 694-72-4
- Chemical structure:
View 3d structure (requires JavaScript / HTML 5) - Stereoisomers:
- Other names: Bicyclo[3.3.0]octane; Octahydropentalene

Normal alkane RI, non-polar column, custom temperature program

Column type | Active phase | I | Reference | Comment |
---|---|---|---|---|
Capillary | Squalane | 870. | Chen, 2008 | Program: not specified |
Capillary | Squalane | 870. | Chen, 2008 | Program: not specified |

References

Chen, 2008
Chen, H.-F.,
Quantitative prediction of gas chromatography retention indices with support vector machines, radial basis neutral networks and multiple linear regression,
Anal. Chim. Acta, 2008, 609, 1, 24-36, https://doi.org/10.1016/j.aca.2008.01.003
. [all data]