2H-Pyran-2-ol, tetrahydro-
- Formula: C5H10O2
- Molecular weight: 102.1317
- IUPAC Standard InChIKey: CELWCAITJAEQNL-UHFFFAOYSA-N
- CAS Registry Number: 694-54-2
- Chemical structure:
View 3d structure (requires JavaScript / HTML 5) - Other names: Tetrahydro-2-hydroxy-2H-pyran; Tetrahydro-2-pyranol; Tetrahydro-2H-pyran-2-ol; 2-Hydroxytetrahydropyran; 2-Tetrahydropyranol; δ-Valerolactol; Pyran-2-ol, tetrahydro-

Reaction thermochemistry data

Data compiled as indicated in comments:
B - John E. Bartmess
ALS - Hussein Y. Afeefy, Joel F. Liebman, and Stephen E. Stein
Individual Reactions
C5H9O2- + =
By formula: C5H9O2- + H+ = C5H10O2
Quantity | Value | Units | Method | Reference | Comment |
---|---|---|---|---|---|
ΔrH° | 1540. ± 13. | kJ/mol | D-EA | Baer, Brinkman, et al., 1991 | gas phase; Structure: cyclic H-bonded 5-hydroxypentanal enolate; B |
ΔrH° | 1496. ± 8.8 | kJ/mol | G+TS | Baer, Brinkman, et al., 1991 | gas phase; For deprotonation of neutral acetal.; B |
ΔrH° | 1502. ± 13. | kJ/mol | G+TS | Bartmess, Hays, et al., 1981 | gas phase; Between CF3CH2OH, MeSH for deprotonation, reprotonates at ca. HOAc due to isomerization.; B |
Quantity | Value | Units | Method | Reference | Comment |
ΔrG° | 1469. ± 8.4 | kJ/mol | IMRB | Baer, Brinkman, et al., 1991 | gas phase; For deprotonation of neutral acetal.; B |
ΔrG° | 1452. ± 13. | kJ/mol | IMRB | Baer, Brinkman, et al., 1991 | gas phase; For reprotonation of anion: structure is cyclic H-bonded cyclic enolate; B |
ΔrG° | 1474. ± 13. | kJ/mol | IMRB | Bartmess, Hays, et al., 1981 | gas phase; Between CF3CH2OH, MeSH for deprotonation, reprotonates at ca. HOAc due to isomerization.; B |
By formula: C5H10O2 = C5H10O2
Quantity | Value | Units | Method | Reference | Comment |
---|---|---|---|---|---|
ΔrH° | 23. | kJ/mol | Eqk | Shono, Godo, et al., 1971 | liquid phase; solvent: DMSO-d6; NMR; ALS |

Gas phase ion energetics data

Data compiled by: John E. Bartmess
De-protonation reactions
C5H9O2- + =
By formula: C5H9O2- + H+ = C5H10O2
Quantity | Value | Units | Method | Reference | Comment |
---|---|---|---|---|---|
ΔrH° | 1540. ± 13. | kJ/mol | D-EA | Baer, Brinkman, et al., 1991 | gas phase; Structure: cyclic H-bonded 5-hydroxypentanal enolate |
ΔrH° | 1496. ± 8.8 | kJ/mol | G+TS | Baer, Brinkman, et al., 1991 | gas phase; For deprotonation of neutral acetal. |
ΔrH° | 1502. ± 13. | kJ/mol | G+TS | Bartmess, Hays, et al., 1981 | gas phase; Between CF3CH2OH, MeSH for deprotonation, reprotonates at ca. HOAc due to isomerization. |
Quantity | Value | Units | Method | Reference | Comment |
ΔrG° | 1469. ± 8.4 | kJ/mol | IMRB | Baer, Brinkman, et al., 1991 | gas phase; For deprotonation of neutral acetal. |
ΔrG° | 1452. ± 13. | kJ/mol | IMRB | Baer, Brinkman, et al., 1991 | gas phase; For reprotonation of anion: structure is cyclic H-bonded cyclic enolate |
ΔrG° | 1474. ± 13. | kJ/mol | IMRB | Bartmess, Hays, et al., 1981 | gas phase; Between CF3CH2OH, MeSH for deprotonation, reprotonates at ca. HOAc due to isomerization. |

References

Baer, Brinkman, et al., 1991
Baer, S.; Brinkman, E.A.; Brauman, J.I.,
Hemiacetal Anions: A Model for Tetrahedral Reaction Intermediates,
J. Am. Chem. Soc., 1991, 113, 3, 805, https://doi.org/10.1021/ja00003a012
. [all data]
Bartmess, Hays, et al., 1981
Bartmess, J.E.; Hays, R.L.; Caldwell, G.,
The Addition of Carbanions to Carbonyl Groups in the Gas Phase,
J. Am. Chem. Soc., 1981, 103, 6, 1338, https://doi.org/10.1021/ja00396a006
. [all data]
Shono, Godo, et al., 1971
Shono, T.; Godo, M.; Shinra, K.,
High resolution NMR studies of ring-chain tautomerism in ω-hydroxy aldehydes,
Bunseki Kagaku, 1971, 20, 1183-1186. [all data]