1H-Pyrazole, 1,3-dimethyl-
- Formula: C5H8N2
- Molecular weight: 96.1304
- IUPAC Standard InChIKey: NODLZCJDRXTSJO-UHFFFAOYSA-N
- CAS Registry Number: 694-48-4
- Chemical structure:
View 3d structure (requires JavaScript / HTML 5) - Other names: Pyrazole, 1,3-dimethyl-; 1,3-Dimethylpyrazole; 2,5-Dimethylpyrazole; 1,3-Dimethyl-1H-pyrazole

Gas phase ion energetics data

Data evaluated by: Edward P. Hunter and Sharon G. Lias
Quantity | Value | Units | Method | Reference | Comment |
---|---|---|---|---|---|
Proton affinity (review) | 933.9 | kJ/mol | N/A | Hunter and Lias, 1998 | |
Quantity | Value | Units | Method | Reference | Comment |
Gas basicity | 902.3 | kJ/mol | N/A | Hunter and Lias, 1998 |

Normal alkane RI, non-polar column, custom temperature program

Column type | Active phase | I | Reference | Comment |
---|---|---|---|---|
Capillary | CP Sil 5 CB | 833. | Guyot, Scheirman, et al., 1999 | He; Column length: 50. m; Column diameter: 0.32 mm; Program: 30C => 55C/min => 85C => 1C/min => 145C => 3C/min => 250C |

References

Hunter and Lias, 1998
Hunter, E.P.; Lias, S.G.,
Evaluated Gas Phase Basicities and Proton Affinities of Molecules: An Update,
J. Phys. Chem. Ref. Data, 1998, 27, 3, 413-656, https://doi.org/10.1063/1.556018
. [all data]
Guyot, Scheirman, et al., 1999
Guyot, C.; Scheirman, V.; Collin, S.,
Floral origin markers of heather honeys: Calluna vulgaris and Erica arborea,
Food Chem., 1999, 64, 1, 3-11, https://doi.org/10.1016/S0308-8146(98)00122-8
. [all data]