1,1-Difluoro-2-vinylcyclopropane
- Formula: C5H6F2
- Molecular weight: 104.0979
- IUPAC Standard InChIKey: QCLGRUGHFNFAFX-UHFFFAOYSA-N
- CAS Registry Number: 694-34-8
- Chemical structure:
View 3d structure (requires JavaScript / HTML 5) - Permanent link for this species. Use this link for bookmarking this species for future reference.

Reaction thermochemistry data

Data compiled by: Hussein Y. Afeefy, Joel F. Liebman, and Stephen E. Stein
Individual Reactions
By formula: 2H2 + C5H6F2 = C5H10F2
Quantity | Value | Units | Method | Reference | Comment |
---|---|---|---|---|---|
ΔrH° | -333. ± 0.8 | kJ/mol | Chyd | Roth, Kirmse, et al., 1982 | liquid phase; solvent: Isooctane |

References

Roth, Kirmse, et al., 1982
Roth, W.R.; Kirmse, W.; Hoffmann, W.; Lennartz, H.W.,
Heats of hydrogenation. III. Effect of fluoro substituents on the thermal rearrangement of cyclopropane systems,
Chem. Ber., 1982, 115, 2508-2515. [all data]