Bicyclo(3.1.0)hex-2-ene
- Formula: C6H8
- Molecular weight: 80.1277
- IUPAC Standard InChIKey: BAOZQZPGQWXJOW-UHFFFAOYSA-N
- CAS Registry Number: 694-01-9
- Chemical structure:
View 3d structure (requires JavaScript / HTML 5) - Permanent link for this species. Use this link for bookmarking this species for future reference.

Gas phase thermochemistry data

Data compiled by: Hussein Y. Afeefy, Joel F. Liebman, and Stephen E. Stein
Quantity | Value | Units | Method | Reference | Comment |
---|---|---|---|---|---|
ΔfH°gas | 158. | kJ/mol | Chyd | Roth, Adamczak, et al., 1991 |

Condensed phase thermochemistry data

Data compiled by: Hussein Y. Afeefy, Joel F. Liebman, and Stephen E. Stein
Quantity | Value | Units | Method | Reference | Comment |
---|---|---|---|---|---|
ΔfH°liquid | 120. ± 3. | kJ/mol | Ccb | Kozina, 1976 | |
Quantity | Value | Units | Method | Reference | Comment |
ΔcH°liquid | -3625. ± 3. | kJ/mol | Ccb | Kozina, 1976 | Corresponding ΔfHºliquid = 120. kJ/mol (simple calculation by NIST; no Washburn corrections) |

Reaction thermochemistry data

Data compiled by: Hussein Y. Afeefy, Joel F. Liebman, and Stephen E. Stein
Individual Reactions
By formula: 2H2 + C6H8 = C6H12
Quantity | Value | Units | Method | Reference | Comment |
---|---|---|---|---|---|
ΔrH° | -264. ± 0.8 | kJ/mol | Chyd | Roth, Adamczak, et al., 1991 | liquid phase |

References

Roth, Adamczak, et al., 1991
Roth, W.R.; Adamczak, O.; Breuckmann, R.; Lennartz, H.-W.; Boese, R.,
Die Berechnung von Resonanzenergien; das MM2ERW-Kraftfeld,
Chem. Ber., 1991, 124, 2499-2521. [all data]
Kozina, 1976
Kozina, M.P.,
Enthalpies of combustion and formation of bicyclic and polycyclic hydrocarbons,
Sovrem. Probl. Fiz. Khim., 1976, 9, 198-225. [all data]