1-Bromodocosane
- Formula: C22H45Br
- Molecular weight: 389.497
- IUPAC Standard InChIKey: QYOXLKAKUAASNA-UHFFFAOYSA-N
- CAS Registry Number: 6938-66-5
- Chemical structure:

Phase change data

Data compiled as indicated in comments:
BS - Robert L. Brown and Stephen E. Stein
TRC - Thermodynamics Research Center, NIST Boulder Laboratories, Chris Muzny director
AC - William E. Acree, Jr., James S. Chickos
Quantity | Value | Units | Method | Reference | Comment |
---|---|---|---|---|---|
Tfus | 317. | K | N/A | Buckingham and Donaghy, 1982 | BS |
Tfus | 313.2 | K | N/A | Hoffman, 1952 | Crystal phase 1 phase; Uncertainty assigned by TRC = 0.6 K; TRC |
Reduced pressure boiling point
Tboil (K) | Pressure (atm) | Reference | Comment |
---|---|---|---|
498. | 0.0008 | Buckingham and Donaghy, 1982 | BS |
Enthalpy of fusion
ΔfusH (kcal/mol) | Temperature (K) | Reference | Comment |
---|---|---|---|
10.75 | 317.1 | Hoffman and Decker, 1953 | AC |

References

Buckingham and Donaghy, 1982
Buckingham, J.; Donaghy, S.M.,
Dictionary of Organic Compounds: Fifth Edition, Chapman and Hall, New York, 1982, 1. [all data]
Hoffman, 1952
Hoffman, J.D.,
Hindered Intermolecuolar Rotation in the Solid State: Thermal and Dielectric Phenomena in Long-Chain Compounds,
J. Chem. Phys., 1952, 20, 541. [all data]
Hoffman and Decker, 1953
Hoffman, John D.; Decker, Beulah F.,
Solid State Phase Changes in Long Chain Compounds,
J. Phys. Chem., 1953, 57, 5, 520-529, https://doi.org/10.1021/j150506a009
. [all data]