Benzoic acid, 4-methoxy-, propyl ester
- Formula: C11H14O3
- Molecular weight: 194.2271
- IUPAC Standard InChIKey: WEHMFTWWOGBHCR-UHFFFAOYSA-N
- CAS Registry Number: 6938-39-2
- Chemical structure:
View 3d structure (requires JavaScript / HTML 5) - Other names: p-Anisic acid, propyl ester; Propyl p-methoxybenzoate; Methyl ether of Propylparaben; Propyl 4-methoxybenzoate; 4-Methoxy Benzoic Acid Propyl Ester

Van Den Dool and Kratz RI, non-polar column, temperature ramp

Column type | Active phase | I | Reference | Comment |
---|---|---|---|---|
Capillary | VF-5MS | 1588. | Todua, 2011 | 30. m/0.25 mm/0.25 μm, He; Tstart: 60. C; Tend: 270. C |

Normal alkane RI, non-polar column, custom temperature program

Column type | Active phase | I | Reference | Comment |
---|---|---|---|---|
Capillary | SE-30 | 1527. | Vinogradov, 2004 | Program: not specified |

Normal alkane RI, polar column, custom temperature program

Column type | Active phase | I | Reference | Comment |
---|---|---|---|---|
Capillary | Carbowax 20M | 2205. | Vinogradov, 2004 | Program: not specified |

References

Todua, 2011
Todua, N.G.,
Retention Data. NIST Mass Spectrometry Data Center., NIST Mass Spectrometry Data Center, 2011. [all data]
Vinogradov, 2004
Vinogradov, B.A.,
Production, composition, properties and application of essential oils, 2004, retrieved from http://viness.narod.ru. [all data]