Decyl sulfide
- Formula: C20H42S
- Molecular weight: 314.612
- IUPAC Standard InChIKey: RKYMVQJWYYOIJB-UHFFFAOYSA-N
- CAS Registry Number: 693-83-4
- Chemical structure:

Phase change data

Data compiled by: Thermodynamics Research Center, NIST Boulder Laboratories, Chris Muzny director
Quantity | Value | Units | Method | Reference | Comment |
---|---|---|---|---|---|
Tfus | 300.40 | K | N/A | Kharasch and Zavist, 1951 | Uncertainty assigned by TRC = 2. K |

Kovats' RI, non-polar column, isothermal

Column type | Active phase | Temperature (C) | I | Reference | Comment |
---|---|---|---|---|---|
Packed | SE-30 | 80. | 2281. | Zotov, Golovkin, et al., 1981 | N2, Chromaton N-AWHMDS; Column length: 1.8 m |
Packed | SE-30 | 190. | 2285. | Golovkin, Smol'chenko, et al., 1980 | N2, Chromaton N-AW-DMCS; Column length: 1. m |

Van Den Dool and Kratz RI, non-polar column, temperature ramp

Column type | Active phase | I | Reference | Comment |
---|---|---|---|---|
Packed | SE-30 | 2295. | Zotov, Golovkin, et al., 1981 | N2, Chromaton N-AWHMDS, 3.9 K/min; Column length: 1.8 m; Tstart: 80. C; Tend: 250. C |

Normal alkane RI, non-polar column, custom temperature program

Column type | Active phase | I | Reference | Comment |
---|---|---|---|---|
Capillary | OV-1, SE-30, Methyl silicone, SP-2100, OV-101, DB-1, etc. | 2295. | Waggott and Davies, 1984 | Hydrogen; Column length: 50. m; Column diameter: 0.32 mm; Program: not specified |

References

Kharasch and Zavist, 1951
Kharasch, M.S.; Zavist, A.F.,
Reactions of Atoms and Free Radicals in Solution. XXIII. The Peroxide- Induced Addition of Sulfuryl Chloride to 1-Alkenes,
J. Am. Chem. Soc., 1951, 73, 964. [all data]
Zotov, Golovkin, et al., 1981
Zotov, L.N.; Golovkin, G.V.; Golovnya, R.V.,
GC Behaviour of Symmetrical n-Dialkyl Sulphides under Isothermal and Temperature Programming Conditions,
J. Hi. Res. Chromatogr. Chromatogr. Comm., 1981, 4, 1, 6-10, https://doi.org/10.1002/jhrc.1240040103
. [all data]
Golovkin, Smol'chenko, et al., 1980
Golovkin, G.V.; Smol'chenko, A.I.; Zotov, L.N.; Sazonov, S.E.,
Systems of gas-chromatographic retention indices for identifying pesticides by means of selective detectors,
Zh. Anal. Khim., 1980, 35, 5, 651-655. [all data]
Waggott and Davies, 1984
Waggott, A.; Davies, I.W.,
Identification of organic pollutants using linear temperature programmed retention indices (LTPRIs) - Part II, 1984, retrieved from http://dwi.defra.gov.uk/research/completed-research/reports/dwi0383.pdf. [all data]