1,1'-Biphenyl, 3,3'-bis-(1-methylethyl)
- Formula: C18H22
- Molecular weight: 238.3673
- IUPAC Standard InChIKey: PYXYYRWLLNHRLM-UHFFFAOYSA-N
- CAS Registry Number: 69375-12-8
- Chemical structure:
View 3d structure (requires JavaScript / HTML 5) - Species with the same structure:
- Other names: 3,3'-Diisopropylbiphenyl

Reaction thermochemistry data

Data compiled by: Hussein Y. Afeefy, Joel F. Liebman, and Stephen E. Stein
Individual Reactions
By formula: C18H22 = C18H22
Quantity | Value | Units | Method | Reference | Comment |
---|---|---|---|---|---|
ΔrH° | -0.15 ± 0.38 | kcal/mol | Eqk | Roshchupkina, Nesterova, et al., 1987 | liquid phase; T=367.5 K |
By formula: C18H22 = C18H22
Quantity | Value | Units | Method | Reference | Comment |
---|---|---|---|---|---|
ΔrH° | 0.0 ± 0.1 | kcal/mol | Eqk | Roshchupkina, Nesterova, et al., 1987 | liquid phase; T=368.0 K |

References

Roshchupkina, Nesterova, et al., 1987
Roshchupkina, I.Yu.; Nesterova, T.N.; Rozhnov, A.M.,
Equilibria of isomeric transformations of alkylbiphenyls,
J. Chem. Thermodyn., 1987, 19, 299-306. [all data]