11-Octadecenoic acid, (E)-

Phase change data

Data compiled as indicated in comments:
TRC - Thermodynamics Research Center, NIST Boulder Laboratories, Chris Muzny director
AC - William E. Acree, Jr., James S. Chickos

Quantity Value Units Method Reference Comment
Tfus316.65KN/AAhmad, Bumpus, et al., 1948Uncertainty assigned by TRC = 1. K; TRC

Enthalpy of fusion

ΔfusH (kJ/mol) Temperature (K) Method Reference Comment
58.49317.TAJalal, Zografi, et al., 1982AC
55.62318.TAJalal, Zografi, et al., 1982AC

In addition to the Thermodynamics Research Center (TRC) data available from this site, much more physical and chemical property data is available from the following TRC products:

References

Ahmad, Bumpus, et al., 1948
Ahmad, K.; Bumpus, F.M.; Strong, F.M., A Synthesis of cis-11-Octadecenoic and trans-11-Octadecenoic Acids, J. Am. Chem. Soc., 1948, 70, 3391. [all data]

Jalal, Zografi, et al., 1982
Jalal, I.M.; Zografi, G.; Rakshit, A.K.; Gunstone, F.D., Thermal analysis of fatty acids, Chemistry and Physics of Lipids, 1982, 31, 4, 395-404, https://doi.org/10.1016/0009-3084(82)90074-3 . [all data]