n-Amyl ether
- Formula: C10H22O
- Molecular weight: 158.2811
- IUPAC Standard InChIKey: AOPDRZXCEAKHHW-UHFFFAOYSA-N
- CAS Registry Number: 693-65-2
- Chemical structure:
View 3d structure (requires JavaScript / HTML 5) - Other names: Pentane, 1,1'-oxybis-; Pentyl ether; n-Pentyl ether; Amyl ether; Di-n-amyl ether; Diamyl ether; Dipentyl ether; (n-C5H11)2O; Di-n-pentyl ether; Ether, di-n-pentyl-; Pentyloxypentane; NSC 6571; 1-(Pentyloxy)pentane

Gas phase thermochemistry data

Data compiled by: Hussein Y. Afeefy, Joel F. Liebman, and Stephen E. Stein
Quantity | Value | Units | Method | Reference | Comment |
---|---|---|---|---|---|
ΔfH°gas | -390. | kJ/mol | Ccb | Murrin and Goldhagen, 1957 |

Condensed phase thermochemistry data

Data compiled by: Hussein Y. Afeefy, Joel F. Liebman, and Stephen E. Stein
Quantity | Value | Units | Method | Reference | Comment |
---|---|---|---|---|---|
ΔfH°liquid | -435.2 ± 3.0 | kJ/mol | Ccb | Murrin and Goldhagen, 1957 | |
Quantity | Value | Units | Method | Reference | Comment |
ΔcH°liquid | -6644. ± 3. | kJ/mol | Ccb | Murrin and Goldhagen, 1957 | Corresponding ΔfHºliquid = -435.1 kJ/mol (simple calculation by NIST; no Washburn corrections) |

Phase change data

Data compiled as indicated in comments:
BS - Robert L. Brown and Stephen E. Stein
TRC - Thermodynamics Research Center, NIST Boulder Laboratories, Chris Muzny director
AC - William E. Acree, Jr., James S. Chickos
Quantity | Value | Units | Method | Reference | Comment |
---|---|---|---|---|---|
Tboil | 460.7 | K | N/A | Aldrich Chemical Company Inc., 1990 | BS |
Tboil | 459. | K | N/A | American Tokyo Kasei, 1988 | BS |
Tboil | 459.9 | K | N/A | Dreisbach and Martin, 1949 | Uncertainty assigned by TRC = 0.07 K; TRC |
Tboil | 460.65 | K | N/A | Timmermans and Martin, 1928 | Uncertainty assigned by TRC = 0.4 K; TRC |
Tboil | 411.2 | K | N/A | Timmermans, 1922 | Uncertainty assigned by TRC = 0.2 K; TRC |
Quantity | Value | Units | Method | Reference | Comment |
Tfus | 203.72 | K | N/A | Dreisbach and Martin, 1949 | Uncertainty assigned by TRC = 0.05 K; TRC |
Tfus | 203.85 | K | N/A | Timmermans and Martin, 1928 | Uncertainty assigned by TRC = 0.4 K; TRC |
Tfus | 204.15 | K | N/A | Timmermans, 1922 | Uncertainty assigned by TRC = 0.2 K; TRC |
Enthalpy of vaporization
ΔvapH (kJ/mol) | Temperature (K) | Method | Reference | Comment |
---|---|---|---|---|
46.2 | 388. | A | Stephenson and Malanowski, 1987 | Based on data from 373. to 460. K.; AC |
45.6 | 451. | N/A | Lapidus and Nisel'son, 1968 | Based on data from 423. to 480. K.; AC |
Antoine Equation Parameters
log10(P) = A − (B / (T + C))
P = vapor pressure (bar)
T = temperature (K)
View plot Requires a JavaScript / HTML 5 canvas capable browser.
Temperature (K) | A | B | C | Reference | Comment |
---|---|---|---|---|---|
378.61 to 459.90 | 3.87144 | 1396.465 | -98.829 | Dreisbach and Shrader, 1949 | Coefficents calculated by NIST from author's data. |

Gas phase ion energetics data

Data evaluated as indicated in comments:
HL - Edward P. Hunter and Sharon G. Lias
Data compiled as indicated in comments:
MM - Michael M. Meot-Ner (Mautner)
Quantity | Value | Units | Method | Reference | Comment |
---|---|---|---|---|---|
Proton affinity (review) | 852.7 | kJ/mol | N/A | Hunter and Lias, 1998 | HL |
Quantity | Value | Units | Method | Reference | Comment |
Gas basicity | 825.3 | kJ/mol | N/A | Hunter and Lias, 1998 | HL |
Gas basicity at 298K
Gas basicity (review) (kJ/mol) | Reference | Comment |
---|---|---|
818.4 ± 0.7 | Decouzon, Gal, et al., 1996 | T = 338K; MM |
819.0 | Decouzon, Gal, et al., 1996 | T = T(eff) = 430K; MM |
819.0 | Decouzon, Gal, et al., 1996 | T = T(eff) = 430K; MM |
819.0 | Decouzon, Gal, et al., 1996 | T = T(eff) = 430K; MM |

Kovats' RI, non-polar column, isothermal

Column type | Active phase | Temperature (C) | I | Reference | Comment |
---|---|---|---|---|---|
Packed | Apolane | 130. | 1051. | Dutoit, 1991 | Column length: 3.7 m |
Packed | SE-30 | 120. | 1076. | García-Raso, Martínez-Castro, et al., 1987 | N2, Supelcoport; Column length: 3. m |
Packed | Apiezon L | 120. | 1056. | Bogoslovsky, Anvaer, et al., 1978 | Celite 545 |
Packed | Apiezon L | 160. | 1059. | Bogoslovsky, Anvaer, et al., 1978 | Celite 545 |
Packed | Apiezon M | 130. | 1058. | Golovnya and Garbuzov, 1974 | N2, Chromosorb W; Column length: 2.1 m |
Packed | SE-30 | 120. | 1070. | Bierl, Beroza, et al., 1972 | Column length: 3.0 m |
Packed | Apiezon L | 130. | 1052. | Wehrli and Kováts, 1959 | Celite; Column length: 2.25 m |
Packed | Apiezon L | 190. | 1057. | Wehrli and Kováts, 1959 | Celite; Column length: 2.25 m |

Kovats' RI, polar column, isothermal

Column type | Active phase | Temperature (C) | I | Reference | Comment |
---|---|---|---|---|---|
Capillary | Carbowax 20M | 120. | 1165. | García-Raso, Martínez-Castro, et al., 1987 | N2, Supelcoport; Column length: 25. m; Column diameter: 0.22 mm |

Van Den Dool and Kratz RI, non-polar column, temperature ramp

Column type | Active phase | I | Reference | Comment |
---|---|---|---|---|
Capillary | DB-1 | 1069.7 | Sun and Stremple, 2003 | 30. m/0.25 mm/0.25 μm, He, 3. K/min; Tstart: 40. C; Tend: 325. C |

Van Den Dool and Kratz RI, non-polar column, custom temperature program

Column type | Active phase | I | Reference | Comment |
---|---|---|---|---|
Capillary | DB-1 | 1070. | Peng, 2000 | 15. m/0.53 mm/1. μm, He; Program: 40C(3min) => 8C/min => 200(1min) => 5C/min => 300C(25min) |

Van Den Dool and Kratz RI, polar column, temperature ramp

Column type | Active phase | I | Reference | Comment |
---|---|---|---|---|
Capillary | DB-Wax | 1172. | Peng, 2000 | 15. m/0.53 mm/1. μm, He, 40. C @ 3. min, 5. K/min, 220. C @ 30. min |
Capillary | HP-Wax | 1173. | Peng, 2000 | 15. m/0.53 mm/1. μm, He, 40. C @ 3. min, 5. K/min, 220. C @ 30. min |

Normal alkane RI, non-polar column, temperature ramp

Column type | Active phase | I | Reference | Comment |
---|---|---|---|---|
Capillary | OV-101 | 1068. | Zenkevich, Eliseenkov, et al., 2011 | 25. m/0.20 mm/0.25 μm, Nitrogen, 6. K/min; Tstart: 40. C; Tend: 220. C |
Capillary | OV-101 | 1077. | Zenkevich, Eliseenkov, et al., 2011 | 25. m/0.20 mm/0.25 μm, Nitrogen, 6. K/min; Tstart: 40. C; Tend: 220. C |

Normal alkane RI, non-polar column, custom temperature program

Column type | Active phase | I | Reference | Comment |
---|---|---|---|---|
Capillary | Squalane | 1076. | Chen, 2008 | Program: not specified |
Capillary | SE-30 | 1065. | Vinogradov, 2004 | Program: not specified |
Capillary | Methyl Silicone | 1052. | N/A | Program: not specified |

Normal alkane RI, polar column, custom temperature program

Column type | Active phase | I | Reference | Comment |
---|---|---|---|---|
Capillary | Carbowax 20M | 1165. | Vinogradov, 2004 | Program: not specified |
Capillary | DB-Wax | 1161. | Peng, Yang, et al., 1991 | Program: not specified |
Capillary | DB-Wax | 1163. | Peng, Yang, et al., 1991 | Program: not specified |

References

Murrin and Goldhagen, 1957
Murrin, J.W.; Goldhagen, S.,
Determination of the C-O bond energy from the heats of combustion of four aliphatic ethers,
NAVORD Report No. 5491, U.S. Naval Powder Factory Res. & Dev. Dept., 1957, 1-14. [all data]
Aldrich Chemical Company Inc., 1990
Aldrich Chemical Company Inc.,
Catalog Handbook of Fine Chemicals, Aldrich Chemical Company, Inc., Milwaukee WI, 1990, 1. [all data]
American Tokyo Kasei, 1988
American Tokyo Kasei,
TCI American Organic Chemical 88/89 Catalog, American Tokyo Kasei, Portland, OR, 1988, 1610. [all data]
Dreisbach and Martin, 1949
Dreisbach, R.R.; Martin, R.A.,
Physical Data on Some Organic Compounds,
Ind. Eng. Chem., 1949, 41, 2875-8. [all data]
Timmermans and Martin, 1928
Timmermans, J.; Martin, F.,
Study of the Physical Constants of Twenty Organic Compounds of the Physical Constants of Twenty Organic Compounds,
J. Chim. Phys. Phys.-Chim. Biol., 1928, 25, 411. [all data]
Timmermans, 1922
Timmermans, J.,
Investigation of the Freezing Point of Organic Substances VII,
Bull. Soc. Chim. Belg., 1922, 31, 389. [all data]
Stephenson and Malanowski, 1987
Stephenson, Richard M.; Malanowski, Stanislaw,
Handbook of the Thermodynamics of Organic Compounds, 1987, https://doi.org/10.1007/978-94-009-3173-2
. [all data]
Lapidus and Nisel'son, 1968
Lapidus, I.I.; Nisel'son, L.A.,
Russ. J. Phys. Chem., 1968, 42, 6, 733. [all data]
Dreisbach and Shrader, 1949
Dreisbach, R.R.; Shrader, S.A.,
Vapor Pressure--Temperature Data on Some Organic Compounds,
Ind. Eng. Chem., 1949, 41, 12, 2879-2880, https://doi.org/10.1021/ie50480a054
. [all data]
Hunter and Lias, 1998
Hunter, E.P.; Lias, S.G.,
Evaluated Gas Phase Basicities and Proton Affinities of Molecules: An Update,
J. Phys. Chem. Ref. Data, 1998, 27, 3, 413-656, https://doi.org/10.1063/1.556018
. [all data]
Decouzon, Gal, et al., 1996
Decouzon, M.; Gal, J.E.; Herreros, M.; Marai, P.C.; Murrell, J.; Todd, J.F.J.,
On the Use of the Kinetic Method for the Determination of Proton Affinities by Fourier-Transfrom Ion Cyclotron Resonance Mass Spectrometry,
Rapid. Comm. Mass Spectrom., 1996, 10, 242. [all data]