2-Decanone
- Formula: C10H20O
- Molecular weight: 156.2652
- IUPAC Standard InChIKey: ZAJNGDIORYACQU-UHFFFAOYSA-N
- CAS Registry Number: 693-54-9
- Chemical structure:
View 3d structure (requires JavaScript / HTML 5) - Other names: Decan-2-one; Methyl octyl ketone; n-C8H17COCH3; Methyl n-octyl ketone; Octyl methyl ketone

Phase change data

Data compiled as indicated in comments:
BS - Robert L. Brown and Stephen E. Stein
TRC - Thermodynamics Research Center, NIST Boulder Laboratories, Chris Muzny director
AC - William E. Acree, Jr., James S. Chickos
Quantity | Value | Units | Method | Reference | Comment |
---|---|---|---|---|---|
Tboil | 485. ± 4. | K | AVG | N/A | Average of 6 values; Individual data points |
Quantity | Value | Units | Method | Reference | Comment |
Tc | 671.8 | K | N/A | Pulliam, Gude, et al., 1995 | Uncertainty assigned by TRC = 0.5 K; TRC |
Quantity | Value | Units | Method | Reference | Comment |
ρc | 1.60 | mol/l | N/A | Pulliam, Gude, et al., 1995 | Uncertainty assigned by TRC = 0.004 mol/l; TRC |
Quantity | Value | Units | Method | Reference | Comment |
ΔvapH° | 60.9 ± 0.5 | kJ/mol | GCC | Saluja, Peacock, et al., 1979 | AC |
Reduced pressure boiling point
Tboil (K) | Pressure (bar) | Reference | Comment |
---|---|---|---|
369.2 | 0.016 | Weast and Grasselli, 1989 | BS |
Enthalpy of vaporization
ΔvapH (kJ/mol) | Temperature (K) | Method | Reference | Comment |
---|---|---|---|---|
51.7 | 332. | A | Stephenson and Malanowski, 1987 | Based on data from 317. to 484. K. See also Stull, 1947.; AC |
55.1 | 372. | A | Stephenson and Malanowski, 1987 | Based on data from 357. to 560. K.; AC |
44.6 | 487. | N/A | Ambrose, Ellender, et al., 1975 | Based on data from 358. to 568. K.; AC |

Van Den Dool and Kratz RI, non-polar column, temperature ramp

Data compiled by: NIST Mass Spectrometry Data Center, William E. Wallace, director

Column type CapillaryCapillaryCapillaryCapillaryCapillary
Active phase HP-5MSCP Sil 5 CBHP-5HP-5DB-1
Column length (m) 20.25.25.30.30.
Carrier gas  H2HeN2He
Substrate
Column diameter (mm) 0.250.250.20.250.25
Phase thickness (μm) 0.25 1.0.250.25
Tstart (C) 60.80.40.60.40.
Tend (C) 240.270.280.220.325.
Heat rate (K/min) 5.10.5.5.3.
Initial hold (min) 4.  10.
Final hold (min) 15. 5.
I 1191.1176.1192.1194.1170.4
ReferenceKallio, Jussila, et al., 2006Ziegenbein, Hanssen, et al., 2006Solina, Baumgartner, et al., 2005Dural, Bagci, et al., 2003Sun and Stremple, 2003
Comment MSDC-RI MSDC-RI MSDC-RI MSDC-RI MSDC-RI
Column type CapillaryCapillaryCapillaryCapillaryCapillary
Active phase DB-5CP Sil 8 CBDB-5HP-1HP-5
Column length (m) 30.60.30.25.30.
Carrier gas HeHeH2
Substrate
Column diameter (mm) 0.250.250.320.20.25
Phase thickness (μm) 1.0.251.0.330.25
Tstart (C) 50.40.40.35.35.
Tend (C) 200.280.210.250.250.
Heat rate (K/min) 2.54.3.4.5.3
Initial hold (min)  2.
Final hold (min)    2.2.
I 1193.71193.1192.1171.11192.7
ReferenceXu, van Stee, et al., 2003Elmore, Mottram, et al., 2000Moio, Piombino, et al., 2000Siegmund and Pfannhauser, 1999Siegmund and Pfannhauser, 1999
Comment MSDC-RI MSDC-RI MSDC-RI MSDC-RI MSDC-RI
Column type CapillaryCapillaryCapillaryCapillaryPacked
Active phase OV-1DB-5DB-1SE-30OV-101
Column length (m) 20.30.60.22.2.5
Carrier gas HeH2H2N2
Substrate     Gas-Chrom Q
Column diameter (mm) 0.320.320.250.30
Phase thickness (μm) 0.31.0.251.0
Tstart (C) 45.40.50.60.50.
Tend (C) 220.210.250.250.220.
Heat rate (K/min) 10.3.2.52.2.
Initial hold (min) 5. 5.
Final hold (min) 10.
I 1179.1192.1171.1168.1172.
ReferenceValero, Sanz, et al., 1999Moio and Addeo, 1998Stashenko, Villa, et al., 1995de Frutos, Sanz, et al., 1991Nixon, Wong, et al., 1979
Comment MSDC-RI MSDC-RI MSDC-RI MSDC-RI MSDC-RI
Column type CapillaryPackedPackedPacked
Active phase OV-1Apiezon MApiezon MApiezon M
Column length (m) 183.1.51.51.5
Carrier gas N2N2N2N2
Substrate  Celite 545Celite 545Celite 545
Column diameter (mm)
Phase thickness (μm)
Tstart (C) 0.75.75.75.
Tend (C) 230.200.200.200.
Heat rate (K/min) 1.6.6.6.
Initial hold (min)
Final hold (min)
I 1174.1153.1156.1158.
ReferenceSchreyen, Dirinck, et al., 1976Golovnya and Uraletz, 1971Golovnya and Uraletz, 1971Golovnya and Uraletz, 1971
Comment MSDC-RI MSDC-RI MSDC-RI MSDC-RI

Van Den Dool and Kratz RI, polar column, temperature ramp

Data compiled by: NIST Mass Spectrometry Data Center, William E. Wallace, director

Column type CapillaryCapillaryCapillaryCapillaryCapillary
Active phase DB-WaxZB-WaxCP-Wax 52CBCarbowax 20MSupelcowax-10
Column length (m) 30.30.60.60.60.
Carrier gas HeHe HeHe
Substrate
Column diameter (mm) 0.250.250.250.250.25
Phase thickness (μm) 0.50.150.250.250.25
Tstart (C) 40.35.35.45.35.
Tend (C) 250.220.203.250.195.
Heat rate (K/min) 4.5.3.2.2.
Initial hold (min) 5.5.4.0.175.
Final hold (min) 15.10.  90.
I 1495.1493.1494.1476.1497.
ReferencePozo-Bayon M.A., Ruiz-Rodriguez A., et al., 2007Ledauphin, Basset, et al., 2006Alasalvar, Taylor, et al., 2005Verzera, Campisi, et al., 2005Chung, Yung, et al., 2002
Comment MSDC-RI MSDC-RI MSDC-RI MSDC-RI MSDC-RI
Column type CapillaryCapillaryCapillaryCapillaryCapillary
Active phase Supelcowax-10CP-Wax 52CBDB-WaxCP-Wax 52CBDB-Wax
Column length (m) 60.50.60.60.60.
Carrier gas HeH2HeHeHe
Substrate
Column diameter (mm) 0.250.320.250.250.32
Phase thickness (μm) 0.25 0.250.250.5
Tstart (C) 35.50.50.45.40.
Tend (C) 195.200.230.250.250.
Heat rate (K/min) 2.2.2.2.4.
Initial hold (min) 5.  0.172.
Final hold (min) 90. 60. 10.
I 1497.1510.1496.1476.1508.
ReferenceChung, Yung, et al., 2001Liu, Yang, et al., 2001Shimoda, Yoshimura, et al., 2001Verzera, Campisi, et al., 2001Le Guen, Prost, et al., 2000
Comment MSDC-RI MSDC-RI MSDC-RI MSDC-RI MSDC-RI
Column type CapillaryCapillaryCapillaryCapillaryCapillary
Active phase Supelcowax-10Supelcowax-10Supelcowax-10Supelcowax-10Supelcowax-10
Column length (m) 60.60.60.60.60.
Carrier gas He
Substrate
Column diameter (mm) 0.250.250.250.250.25
Phase thickness (μm) 0.250.250.250.250.25
Tstart (C) 40.40.40.40.40.
Tend (C) 195.175.175.175.175.
Heat rate (K/min) 2.2.2.2.2.
Initial hold (min) 5.5.5.5.5.
Final hold (min) 40.20.20.20.20.
I 1498.1496.1496.1497.1500.
ReferenceChung and Cadwallader, 1993Tanchotikul and Hsieh, 1989Tanchotikul and Hsieh, 1989Vejaphan, Hsieh, et al., 1988Vejaphan, Hsieh, et al., 1988
Comment MSDC-RI MSDC-RI MSDC-RI MSDC-RI MSDC-RI

Normal alkane RI, polar column, custom temperature program

Data compiled by: NIST Mass Spectrometry Data Center, William E. Wallace, director

Column type CapillaryCapillaryCapillaryCapillaryCapillary
Active phase DB-WaxDB-WaxSupelcowax 10Carbowax 20MCarbowax 20M
Column length (m) 30.30.50.
Carrier gas HeliumHeliumHelium
Substrate
Column diameter (mm) 0.250.250.25
Phase thickness (μm) 0.250.250.25
Program not specifiednot specified45 0C (15 min) 3 0C/min -> 75 0C 5 0C/min -> 180 0C (10 min)not specifiednot specified
I 1489.1493.1494.1476.1480.
ReferenceWelke, Manfroi, et al., 2012Welke, Manfroi, et al., 2012Soria, Martinez-Castro, et al., 2008Editorial paper, 2005Vinogradov, 2004
Comment MSDC-RI MSDC-RI MSDC-RI MSDC-RI MSDC-RI
Column type Capillary
Active phase DB-Wax
Column length (m) 60.
Carrier gas N2
Substrate
Column diameter (mm)
Phase thickness (μm) 0.25
Program not specified
I 1497.
ReferenceWeyerstahl, Marschall, et al., 1998
Comment MSDC-RI

Normal alkane RI, non-polar column, isothermal

Data compiled by: NIST Mass Spectrometry Data Center, William E. Wallace, director

Column type CapillaryCapillary
Active phase Polydimethyl siloxaneOV-1
Column length (m)
Carrier gas
Substrate
Column diameter (mm)
Phase thickness (μm)
Temperature (C) 105.60.
I 1172.1169.
ReferenceTello, Lebron-Aguilar, et al., 2009Amboni, Junkes, et al., 2002
Comment MSDC-RI MSDC-RI

Gas phase ion energetics data

Data compiled by: John E. Bartmess

De-protonation reactions

C10H19O- + Hydrogen cation = 2-Decanone

By formula: C10H19O- + H+ = C10H20O

Quantity Value Units Method Reference Comment
Δr1522. ± 9.2kJ/molTDEqBurkell, Fridgen, et al., 2003gas phase
Quantity Value Units Method Reference Comment
Δr1494. ± 8.8kJ/molTDEqBurkell, Fridgen, et al., 2003gas phase

References

Pulliam, Gude, et al., 1995
Pulliam, M.K.; Gude, M.T.; Teja, A.S.,
Critical Temperatures and Densities of n-Alkanones,
J. Chem. Eng. Data, 1995, 40, 455-8. [all data]
Saluja, Peacock, et al., 1979
Saluja, P.P.S.; Peacock, L.A.; Fuchs, R.,
Enthalpies of interaction of aliphatic ketones with polar and nonpolar solvents,
J. Am. Chem. Soc., 1979, 101, 1958-1962. [all data]
Weast and Grasselli, 1989
CRC Handbook of Data on Organic Compounds, 2nd Editon, Weast,R.C and Grasselli, J.G., ed(s)., CRC Press, Inc., Boca Raton, FL, 1989, 1. [all data]
Stephenson and Malanowski, 1987
Stephenson, Richard M.; Malanowski, Stanislaw,
Handbook of the Thermodynamics of Organic Compounds, 1987, https://doi.org/10.1007/978-94-009-3173-2
. [all data]
Stull, 1947
Stull, Daniel R.,
Vapor Pressure of Pure Substances. Organic and Inorganic Compounds,
Ind. Eng. Chem., 1947, 39, 4, 517-540, https://doi.org/10.1021/ie50448a022
. [all data]
Ambrose, Ellender, et al., 1975
Ambrose, D.; Ellender, J.H.; Lees, E.B.; Sprake, C.H.S.; Townsend, R.,
Thermodynamic properties of organic oxygen compounds XXXVIII. Vapour pressures of some aliphatic ketones,
The Journal of Chemical Thermodynamics, 1975, 7, 5, 453-472, https://doi.org/10.1016/0021-9614(75)90275-X
. [all data]