Ethanol, 2,2'-oxybis-, dinitrate
- Formula: C4H8N2O7
- Molecular weight: 196.1155
- IUPAC Standard InChIKey: LYAGTVMJGHTIDH-UHFFFAOYSA-N
- CAS Registry Number: 693-21-0
- Chemical structure:
View 3d structure (requires JavaScript / HTML 5) - Other names: Diethylene glycol, dinitrate; Diglycol dinitrate; Dinitrodiglycol; Oxydiethylene nitrate; 2,2'-Oxydiethanol dinitrate; Digol dinitrate; Bis(hydroxyaethyl)-aether-dinitrat; Diethylenglykoldinitrate; Diglycoldinitraat; Diglykoldinitrat; Di(hydroxyethyl) ether dinitrate; Dinitrate de diethylene-glycol; Dinitrodiglicol; Dinitrodiglykol; DEGDN; Ethanol, 2,2'-oxybis-, 1,1'-dinitrate; oxydiethylene dinitrate

Condensed phase thermochemistry data

Data compiled by: Hussein Y. Afeefy, Joel F. Liebman, and Stephen E. Stein
Quantity | Value | Units | Method | Reference | Comment |
---|---|---|---|---|---|
ΔfH°liquid | -451.0 | kJ/mol | Ccb | Handrick, 1956 | Naval Powder Factory, 1951 |
Quantity | Value | Units | Method | Reference | Comment |
ΔcH°liquid | -2261. | kJ/mol | Ccb | Handrick, 1956 | Naval Powder Factory, 1951 |
ΔcH°liquid | -2291. | kJ/mol | Ccb | Handrick, 1956 | W. R. Tomlinson 1949 |
ΔcH°liquid | -2297.6 | kJ/mol | Ccb | Castronia, 1949 | |
ΔcH°liquid | -2291. | kJ/mol | Ccb | Rinkenbach, 1927 | |
Quantity | Value | Units | Method | Reference | Comment |
ΔfH°solid | -476.1 | kJ/mol | Ccb | Baroody and Carpenter, 1972 |

Phase change data

Data compiled by: William E. Acree, Jr., James S. Chickos
Enthalpy of vaporization
ΔvapH (kJ/mol) | Temperature (K) | Method | Reference | Comment |
---|---|---|---|---|
94.3 | 308. | A | Stephenson and Malanowski, 1987 | Based on data from 293. to 333. K. |
Enthalpy of fusion
ΔfusH (kJ/mol) | Temperature (K) | Reference |
---|---|---|
25.4 | 276.5 | Ur'yash, Kupriyanov, et al., 2000 |

Kovats' RI, non-polar column, isothermal

Column type | Active phase | Temperature (C) | I | Reference | Comment |
---|---|---|---|---|---|
Capillary | DB-5 | 140. | 1351.13 | Hobbs and Conde, 1992 | 30. m/0.25 mm/0.25 μm |
Capillary | DB-5 | 140. | 1357.28 | Hobbs and Conde, 1992 | 30. m/0.25 mm/0.25 μm |

Van Den Dool and Kratz RI, non-polar column, temperature ramp

Column type | Active phase | I | Reference | Comment |
---|---|---|---|---|
Capillary | DB-5 | 1332.85 | Hobbs and Conde, 1992 | 30. m/0.25 mm/0.25 μm, 5. K/min; Tstart: 40. C; Tend: 300. C |
Capillary | DB-5 | 1344.19 | Hobbs and Conde, 1992 | 30. m/0.25 mm/0.25 μm, 5. K/min; Tstart: 40. C; Tend: 300. C |

References

Handrick, 1956
Handrick, G.R.,
Report of the study of pure explosive compounds. Part IV. Calculation of heat of combustion of organic compounds from structural features and calculation of power of high explosives, Rpt. C-58247 for the Office of the Chief of Ordnance, contract DA-19-020-ORD-47 by the Arthur D. Little, Inc., Cambridge, MA, 1956, 467-573. [all data]
Castronia, 1949
Castronia, T.C.,
Long range basic research leading to the development of ideal propellants,
Picatinny Arsenal Techn. Rep. No. 1755, 1949, 1. [all data]
Rinkenbach, 1927
Rinkenbach, Wm.H.,
Preparation and properties of diethyleneglycol dinitrate,
Ind. Eng. Chem., 1927, 19, 925-927. [all data]
Baroody and Carpenter, 1972
Baroody, E.E.; Carpenter, G.A.,
Heats of formation of propellant compounds (U), Rpt. Naval Ordnance Systems Command Task No. 331-003/067-1/UR2402-001 for Naval Ordance Station, Indian Head, MD, 1972, 1-9. [all data]
Stephenson and Malanowski, 1987
Stephenson, Richard M.; Malanowski, Stanislaw,
Handbook of the Thermodynamics of Organic Compounds, 1987, https://doi.org/10.1007/978-94-009-3173-2
. [all data]
Ur'yash, Kupriyanov, et al., 2000
Ur'yash, V.F.; Kupriyanov, V.F.; Kokurina, N.Yu.; Smirnov, A.G.; Kuleshova, T.M.,
Russ. J. Gen. Chem., 2000, 70, 5, 719. [all data]
Hobbs and Conde, 1992
Hobbs, J.R.; Conde, E.P.,
Gas chromatographic retention indices of explosives and nitro-compounds
in Advances in Analysis and Detection of Explosives: Proceedings of the 4th International Symposium on Analysis of Detection of Explosives, September 7-10, 1992, Jerusalem Israel, J. Yinon, ed(s)., Kluwer Academic Publishers, Netherlands, 1992, 153-164. [all data]