2-Propanamine, N,N'-methanetetraylbis-
- Formula: C7H14N2
- Molecular weight: 126.1995
- IUPAC Standard InChIKey: BDNKZNFMNDZQMI-UHFFFAOYSA-N
- CAS Registry Number: 693-13-0
- Chemical structure:

Condensed phase thermochemistry data

Data compiled by: Hussein Y. Afeefy, Joel F. Liebman, and Stephen E. Stein
Quantity | Value | Units | Method | Reference | Comment |
---|---|---|---|---|---|
ΔfH°liquid | -4.96 | kcal/mol | Ccb | Salley and Gray, 1951 | correction of Salley and Gray, 1948 |
Quantity | Value | Units | Method | Reference | Comment |
ΔcH°liquid | -1131.62 | kcal/mol | Ccb | Salley and Gray, 1951 | correction of Salley and Gray, 1948 |

Normal alkane RI, non-polar column, temperature ramp

Column type | Active phase | I | Reference | Comment |
---|---|---|---|---|
Capillary | OV-101 | 908. | Zenkevich, 2005 | 25. m/0.20 mm/0.10 μm, N2/He, 6. K/min; Tstart: 50. C; Tend: 250. C |

References

Salley and Gray, 1951
Salley, D.J.; Gray, J.B.,
Heats of combustion of some organic nitrogen compounds,
J. Am. Chem. Soc., 1951, 73, 5925. [all data]
Salley and Gray, 1948
Salley, D.J.; Gray, J.B.,
Heats of combustion of some organic nitrogen compounds,
J. Am. Chem. Soc., 1948, 70, 2650-2653. [all data]
Zenkevich, 2005
Zenkevich, I.G.,
Experimentally measured retention indices., 2005. [all data]