2-Chloroethyl ethyl sulfide
- Formula: C4H9ClS
- Molecular weight: 124.632
- IUPAC Standard InChIKey: GBNVXYXIRHSYEG-UHFFFAOYSA-N
- CAS Registry Number: 693-07-2
- Chemical structure:
View 3d structure (requires JavaScript / HTML 5) - Other names: Ethane, 1-chloro-2-(ethylthio)-; β-Ethylmerkaptoethylchlorid; Ethyl 2-chloroethyl sulfide; Sulfide, chloroethyl ethyl; Sulfide, 2-chloroethyl ethyl; 1-Chloro-2-(ethylthio)ethane; 2-(Ethylthio)chloroethane; 2-Chloroethyl ethyl thioether; 2-Ethylthioethyl chloride; Chlordiethylsulfid; Ethyl β-chloroethyl sulfide; Half-mustard gas; h-MG; NSC 10977; Half-sulfur mustard; 2-chloroethyl ethyl sulphide

Phase change data

Data compiled as indicated in comments:
BS - Robert L. Brown and Stephen E. Stein
AC - William E. Acree, Jr., James S. Chickos
Quantity | Value | Units | Method | Reference | Comment |
---|---|---|---|---|---|
Tboil | 430.2 | K | N/A | Weast and Grasselli, 1989 | BS |
Reduced pressure boiling point
Tboil (K) | Pressure (bar) | Reference | Comment |
---|---|---|---|
337.2 | 0.063 | Weast and Grasselli, 1989 | BS |
Enthalpy of vaporization
ΔvapH (kJ/mol) | Temperature (K) | Method | Reference | Comment |
---|---|---|---|---|
44.4 | 308. | A,GS | Stephenson and Malanowski, 1987 | Based on data from 293. to 333. K. See also Redemann, Chaikin, et al., 1948 and Dykyj, 1971.; AC |

References

Weast and Grasselli, 1989
CRC Handbook of Data on Organic Compounds, 2nd Editon, Weast,R.C and Grasselli, J.G., ed(s)., CRC Press, Inc., Boca Raton, FL, 1989, 1. [all data]
Stephenson and Malanowski, 1987
Stephenson, Richard M.; Malanowski, Stanislaw,
Handbook of the Thermodynamics of Organic Compounds, 1987, https://doi.org/10.1007/978-94-009-3173-2
. [all data]
Redemann, Chaikin, et al., 1948
Redemann, C. Ernst; Chaikin, Saul W.; Fearing, Ralph B.,
The Volatility and Vapor Pressure of Eight 2-Chloroethyl Alkyl (or Cycloalkyl) Sulfides 1,
J. Am. Chem. Soc., 1948, 70, 2, 631-633, https://doi.org/10.1021/ja01182a059
. [all data]
Dykyj, 1971
Dykyj, J.,
Petrochemia, 1971, 11, 2, 27. [all data]