p-Methoxyheptanophenone
- Formula: C14H20O2
- Molecular weight: 220.3074
- IUPAC Standard InChIKey: ADNCVBHGESSUHS-UHFFFAOYSA-N
- CAS Registry Number: 69287-13-4
- Chemical structure:
View 3d structure (requires JavaScript / HTML 5) - Permanent link for this species. Use this link for bookmarking this species for future reference.

Phase change data

Data compiled by: Robert L. Brown and Stephen E. Stein
Reduced pressure boiling point
Tboil (K) | Pressure (bar) | Reference |
---|---|---|
465. | 0.023 | Frinton Laboratories Inc., 1986 |

References

Frinton Laboratories Inc., 1986
Frinton Laboratories Inc.,
Catalog Number 11, Frinton Laboratories Inc., Vineland, NJ, 1986, 99. [all data]