Formic acid, ethenyl ester

Normal alkane RI, polar column, custom temperature program

View large format table.

Column type Active phase I Reference Comment
CapillarySupelcowax-101090.Kourkoutas, Kandylis, et al., 200660. m/0.32 mm/0.25 μm, He; Program: 35C(3min) => 5C/min => 110C => 10C/min => 240C (10min)

References

Kourkoutas, Kandylis, et al., 2006
Kourkoutas, Y.; Kandylis, P.; Panas, P.; Dooley, J.S.G.; Nigam, P.; Koutinas, A.A., Evaluation of freeze-dried kefir coculture as starter in feta-type cheese production, Appl. Environ. Microbiol., 2006, 72, 9, 6124-6135, https://doi.org/10.1128/AEM.03078-05 . [all data]