Propanoic acid, 3-chloro-, 1-methylethyl ester
- Formula: C6H11ClO2
- Molecular weight: 150.603
- IUPAC Standard InChIKey: YPAMSUOJRFMSIA-UHFFFAOYSA-N
- CAS Registry Number: 691-93-0
- Chemical structure:
View 3d structure (requires JavaScript / HTML 5) - Other names: Propionic acid, 3-chloro-, isopropyl ester; Isopropyl 3-chloropropionate; Isopropyl-beta-chloro propionate; 3-Chloropropionic acid, isopropyl ester

Condensed phase thermochemistry data

Data compiled by: Hussein Y. Afeefy, Joel F. Liebman, and Stephen E. Stein
Quantity | Value | Units | Method | Reference | Comment |
---|---|---|---|---|---|
ΔcH°liquid | -3396. | kJ/mol | Ccb | Schjanberg, 1935 |

Kovats' RI, non-polar column, isothermal

Column type | Active phase | Temperature (C) | I | Reference | Comment |
---|---|---|---|---|---|
Capillary | SE-30 | 100. | 939. | Haken and Korhonen, 1985 | Column length: 25. m; Column diameter: 0.33 mm |
Capillary | SE-30 | 120. | 930. | Haken and Korhonen, 1985 | Column length: 25. m; Column diameter: 0.33 mm |
Capillary | SE-30 | 140. | 951. | Haken and Korhonen, 1985 | Column length: 25. m; Column diameter: 0.33 mm |
Capillary | SE-30 | 60. | 952. | Haken and Korhonen, 1985 | Column length: 25. m; Column diameter: 0.33 mm |
Capillary | SE-30 | 80. | 947. | Haken and Korhonen, 1985 | Column length: 25. m; Column diameter: 0.33 mm |
Capillary | OV-101 | 100. | 945. | Horna, Táborský, et al., 1985 | N2; Column length: 19. m; Column diameter: 0.28 mm |
Capillary | OV-101 | 80. | 943. | Komárek, Hornová, et al., 1983 | Column length: 15. m; Column diameter: 0.22 mm |

Kovats' RI, polar column, isothermal

Column type | Active phase | Temperature (C) | I | Reference | Comment |
---|---|---|---|---|---|
Capillary | OV-351 | 100. | 1372. | Haken and Korhonen, 1985 | N2; Column length: 25. m; Column diameter: 0.32 mm |
Capillary | OV-351 | 120. | 1388. | Haken and Korhonen, 1985 | N2; Column length: 25. m; Column diameter: 0.32 mm |
Capillary | OV-351 | 60. | 1374. | Haken and Korhonen, 1985 | N2; Column length: 25. m; Column diameter: 0.32 mm |
Capillary | OV-351 | 80. | 1371. | Haken and Korhonen, 1985 | N2; Column length: 25. m; Column diameter: 0.32 mm |
Capillary | SP-1000 | 100. | 1366. | Horna, Táborský, et al., 1985 | N2; Column length: 46. m; Column diameter: 0.23 mm |

References

Schjanberg, 1935
Schjanberg, E.,
Die Verbrennungswarmen und die Refraktionsdaten einiger chlorsubstituierter Fettsauren und Ester.,
Z. Phys. Chem. Abt. A, 1935, 172, 197-233. [all data]
Haken and Korhonen, 1985
Haken, J.K.; Korhonen, I.O.O.,
Gas-liquid chromatography of homologous esters. XXIX. Propanoyl and monochlorpropanoyl esters of lower saturated branched-chain and unsaturated alcohols,
J. Chromatogr., 1985, 324, 343-353, https://doi.org/10.1016/S0021-9673(01)81333-9
. [all data]
Horna, Táborský, et al., 1985
Horna, A.; Táborský, J.; Churácek, J.; Dufka, O.,
Chromatography of monomers. IV. Gas-liquid chromatographic studies of C1-C6 n-alkyl and C3-C6 isoalkyl acrylates and their hydrogen halide and halogen addition derivatives,
J. Chromatogr., 1985, 348, 141-149, https://doi.org/10.1016/S0021-9673(01)92447-1
. [all data]
Komárek, Hornová, et al., 1983
Komárek, K.; Hornová, L.; Horna, A.; Churácek, J.,
Glass capillary gas chromatography of homologous series of esters. III. Separation of alkyl halogenopropionates and halogenobutyrates on OV-101,
J. Chromatogr., 1983, 262, 316-320, https://doi.org/10.1016/S0021-9673(01)88112-7
. [all data]