Chlorodimethylethylsilane
- Formula: C4H11ClSi
- Molecular weight: 122.669
- IUPAC Standard InChIKey: AVDUEHWPPXIAEB-UHFFFAOYSA-N
- CAS Registry Number: 6917-76-6
- Chemical structure:
View 3d structure (requires JavaScript / HTML 5) - Other names: Ethyldimethylchlorosilane; Silane, chloroethyldimethyl-; Silane, chlorodimethylethyl-,; Chloro(ethyl)dimethylsilane

Normal alkane RI, non-polar column, temperature ramp

Column type | Active phase | I | Reference | Comment |
---|---|---|---|---|
Capillary | OV-101 | 676. | Zenkevich, 2005 | 25. m/0.20 mm/0.10 μm, N2/He, 6. K/min; Tstart: 50. C; Tend: 250. C |

References

Zenkevich, 2005
Zenkevich, I.G.,
Experimentally measured retention indices., 2005. [all data]