4,5-Dimethyl-4-cyclohexene-1,1,2,2-tetracarbonitrile
- Formula: C12H10N4
- Molecular weight: 210.2346
- CAS Registry Number: 69155-29-9

Phase change data

Data compiled as indicated in comments:
ALS - Hussein Y. Afeefy, Joel F. Liebman, and Stephen E. Stein
AC - William E. Acree, Jr., James S. Chickos
Quantity | Value | Units | Method | Reference | Comment |
---|---|---|---|---|---|
ΔsubH° | 108. ± 4.2 | kJ/mol | V | Rogers, 1972 | ALS |
Enthalpy of sublimation
ΔsubH (kJ/mol) | Temperature (K) | Reference | Comment |
---|---|---|---|
107.9 ± 4.2 | 378. | Rogers, 1972 | See also Pedley and Rylance, 1977.; AC |

Reaction thermochemistry data

Data compiled by: Hussein Y. Afeefy, Joel F. Liebman, and Stephen E. Stein
Individual Reactions
By formula: C6H10 + C6N4 = C12H10N4
Quantity | Value | Units | Method | Reference | Comment |
---|---|---|---|---|---|
ΔrH° | -165.6 ± 1.8 | kJ/mol | Cm | Rogers, 1972 | liquid phase |
By formula: C12H10N4 = C6H10 + C6N4
Quantity | Value | Units | Method | Reference | Comment |
---|---|---|---|---|---|
ΔrH° | 165.6 ± 1.8 | kJ/mol | Cm | Rogers, 1972 | solid phase |

Gas phase thermochemistry data

Data compiled by: Hussein Y. Afeefy, Joel F. Liebman, and Stephen E. Stein

Quantity Value Units Method Reference Comment
Δfgas580.3kJ/molCmRogers, 1972

References

Rogers, 1972
Rogers, F.E.,
Thermochemistry of the Diels-Alder reactions. II. Heat of addition of several dienes to tetracyanoethylene,
J. Phys. Chem., 1972, 76, 106-109. [all data]
Pedley and Rylance, 1977
Pedley, J.B.; Rylance, J.,
, Computer Analysed Thermochemical Data: Organic and Organometallic Compounds, University of Sussex, Brighton, 1977. [all data]