C5H12NO2

Reaction thermochemistry data

Data compiled by: John E. Bartmess

Individual Reactions

C5H11NO2- + Hydrogen cation = C5H12NO2

By formula: C5H11NO2- + H+ = C5H12NO2

Quantity Value Units Method Reference Comment
Δr1004. ± 13.kJ/molG+TSPatrick, Yang, et al., 1996gas phase
Quantity Value Units Method Reference Comment
Δr974. ± 12.kJ/molCIDCPatrick, Yang, et al., 1996gas phase

References

Patrick, Yang, et al., 1996
Patrick, J.S.; Yang, S.S.; Cooks, R.G., Determination of the Gas-Phase Basicity of Betaine and Related Compounds Using the Kinetic Method, J. Am. Chem. Soc., 1996, 118, 231. [all data]