Malic Acid
- Formula: C4H6O5
- Molecular weight: 134.0874
- IUPAC Standard InChIKey: BJEPYKJPYRNKOW-UHFFFAOYSA-N
- CAS Registry Number: 6915-15-7
- Chemical structure:
View 3d structure (requires JavaScript / HTML 5) - Stereoisomers:
- Other names: Butanedioic acid, hydroxy-; α-Hydroxysuccinic acid; Hydroxyethane-1,2-dicarboxylic acid; Hydroxysuccinic acid; Pomalus acid; dl-Malic acid; Deoxytetraric acid; Kyselina hydroxybutandiova; Kyselina jablecna; Succinic acid, hydroxy-; Hydroxybutanedioic acid; (.+/-.)-Malic acid; 2-Hydroxyethane-1,2-dicarboxylic acid; Butanedioic acid, 2-hydroxy-; FDA 2018; Musashi-no-Ringosan; NSC 25941; R,S(.+/-.)-Malic acid; Apple acid (Salt/Mix)

Phase change data

Data compiled as indicated in comments:
TRC - Thermodynamics Research Center, NIST Boulder Laboratories, Chris Muzny director
DH - Eugene S. Domalski and Elizabeth D. Hearing
Quantity | Value | Units | Method | Reference | Comment |
---|---|---|---|---|---|
Tfus | 400.75 | K | N/A | Wilhoit and Shiao, 1964 | Uncertainty assigned by TRC = 0.6 K; TRC |
Enthalpy of phase transition
ΔHtrs (kJ/mol) | Temperature (K) | Initial Phase | Final Phase | Reference | Comment |
---|---|---|---|---|---|
33.522 | 402. | crystaline, I | liquid | Ceolin, Szwarc, et al., 1990 | Stable form I.; DH |
30.170 | 396. | crystaline, II | liquid | Ceolin, Szwarc, et al., 1990 | Stable form II.; DH |

Henry's Law data

Data compiled by: Rolf Sander
Henry's Law constant (water solution)
kH(T) = k°H exp(d(ln(kH))/d(1/T) ((1/T) - 1/(298.15 K)))
k°H = Henry's law constant for solubility in water at 298.15 K (mol/(kg*bar))
d(ln(kH))/d(1/T) = Temperature dependence constant (K)
k°H (mol/(kg*bar)) | d(ln(kH))/d(1/T) (K) | Method | Reference | Comment |
---|---|---|---|---|
2.0×10+13 | E | N/A | Value obtained by missing citation using the group contribution method. |

References

Wilhoit and Shiao, 1964
Wilhoit, R.C.; Shiao, D.,
Thermochemistry of Biologically Important Compounds. Heats of Combustion of Solid Organic Acids,
J. Chem. Eng. Data, 1964, 9, 595. [all data]
Ceolin, Szwarc, et al., 1990
Ceolin, R.; Szwarc, H.; Lepage, F.,
On the dimorphism of DL-malic acid,
Thermochim. Acta, 1990, 158(2), 347-352. [all data]