isopropyl hydrogen sulphate
- IUPAC Standard InChIKey: IVNFTPCOZIGNAE-UHFFFAOYSA-N
- CAS Registry Number: 6914-90-5
- Chemical structure:
View 3d structure (requires JavaScript / HTML 5) - Permanent link for this species. Use this link for bookmarking this species for future reference.

Reaction thermochemistry data

Data compiled by: Hussein Y. Afeefy, Joel F. Liebman, and Stephen E. Stein
Individual Reactions
By formula: C3H6 + H2O4S = isopropyl hydrogen sulphate
Quantity | Value | Units | Method | Reference | Comment |
---|---|---|---|---|---|
ΔrH° | -38. ± 0.8 | kJ/mol | Eqk | Entelis, Korovina, et al., 1960 | liquid phase |

References

Entelis, Korovina, et al., 1960
Entelis, S.G.; Korovina, G.V.; Chirkov, N.M.,
The thermodynamics of propylene absorption by the H2SO4-H20 system,
Dokl. Akad. Nauk SSSR, 1960, 134, 856-859. [all data]