5-Hexen-3-yn-2-ol, 2-methyl-
- Formula: C7H10O
- Molecular weight: 110.1537
- IUPAC Standard InChIKey: OYWGYGPXPDGOGH-UHFFFAOYSA-N
- CAS Registry Number: 690-94-8
- Chemical structure:

Condensed phase thermochemistry data

Data compiled by: Hussein Y. Afeefy, Joel F. Liebman, and Stephen E. Stein
Quantity | Value | Units | Method | Reference | Comment |
---|---|---|---|---|---|
ΔfH°liquid | -14.6 ± 0.7 | kJ/mol | Ccb | Van-Chin-Syan, Dolbneva, et al., 1982 | |
Quantity | Value | Units | Method | Reference | Comment |
ΔcH°liquid | -4169.2 ± 0.5 | kJ/mol | Ccb | Van-Chin-Syan, Dolbneva, et al., 1982 | Corresponding ΔfHºliquid = -14.5 kJ/mol (simple calculation by NIST; no Washburn corrections) |

Phase change data

Data compiled as indicated in comments:
ALS - Hussein Y. Afeefy, Joel F. Liebman, and Stephen E. Stein
DRB - Donald R. Burgess, Jr.
Quantity | Value | Units | Method | Reference | Comment |
---|---|---|---|---|---|
ΔvapH° | 60.8 ± 0.2 | kJ/mol | V | Van-Chin-Syan, Dolbneva, et al., 1982 | ALS |
ΔvapH° | 60.8 | kJ/mol | N/A | Van-Chin-Syan, Dolbneva, et al., 1982 | DRB |

Gas phase thermochemistry data

Data compiled by: Hussein Y. Afeefy, Joel F. Liebman, and Stephen E. Stein
Quantity | Value | Units | Method | Reference | Comment |
---|---|---|---|---|---|
ΔfH°gas | 46.2 ± 0.8 | kJ/mol | Ccb | Van-Chin-Syan, Dolbneva, et al., 1982 |

References

Van-Chin-Syan, Dolbneva, et al., 1982
Van-Chin-Syan, Yu.Ya.; Dolbneva, T.N.; Vasil'ev, V.P.; Chuchmarev, S.K.; Puchin, V.A.,
Thermodynamic Properties of Dimethyl-vinylethynylmethanol and its derivatives,
Russ. J. Phys. Chem. (Engl. Transl.), 1982, 56, 1736-1767. [all data]