3-Hexene, 2,2-dimethyl-, (E)-
- Formula: C8H16
- Molecular weight: 112.2126
- IUPAC Standard InChIKey: JPLZSSHKQZJYTJ-VOTSOKGWSA-N
- CAS Registry Number: 690-93-7
- Chemical structure:
View 3d structure (requires JavaScript / HTML 5) - Species with the same structure:
- Stereoisomers:
- Other names: (E)-2,2-Dimethyl-3-hexene; trans-2,2-Dimethyl-3-hexene; 2,2-Dimethyl-trans-3-hexene; (E)-2,2-Dimethylhex-3-ene

Gas phase thermochemistry data

Data compiled by: Donald R. Burgess, Jr.
Quantity | Value | Units | Method | Reference | Comment |
---|---|---|---|---|---|
ΔfH°gas | -118.0 | kJ/mol | N/A | Yates and McDonald, 1973 | Value computed using ΔfHliquid° value of -157.8±2 kj/mol from Yates and McDonald, 1973 and ΔvapH° value of 39.8 kj/mol from alkenes correlation. |

Condensed phase thermochemistry data

Data compiled by: Hussein Y. Afeefy, Joel F. Liebman, and Stephen E. Stein
Quantity | Value | Units | Method | Reference | Comment |
---|---|---|---|---|---|
ΔfH°liquid | -157.8 ± 2.0 | kJ/mol | Ccb | Yates and McDonald, 1973 | |
Quantity | Value | Units | Method | Reference | Comment |
ΔcH°liquid | -5276.9 ± 2.0 | kJ/mol | Ccb | Yates and McDonald, 1973 | Corresponding ΔfHºliquid = -157.8 kJ/mol (simple calculation by NIST; no Washburn corrections) |
ΔcH°liquid | -5267.0 ± 1.4 | kJ/mol | Ccb | Yates and McDonald, 1971 | Corresponding ΔfHºliquid = -167.7 kJ/mol (simple calculation by NIST; no Washburn corrections) |
ΔcH°liquid | -5289.7 ± 1.2 | kJ/mol | Ccb | Rockenfeller and Rossini, 1961 | Derived from the ratio of Heat of combustion; Corresponding ΔfHºliquid = -145.0 kJ/mol (simple calculation by NIST; no Washburn corrections) |

Phase change data

Data compiled as indicated in comments:
BS - Robert L. Brown and Stephen E. Stein
TRC - Thermodynamics Research Center, NIST Boulder Laboratories, Chris Muzny director
AC - William E. Acree, Jr., James S. Chickos
ALS - Hussein Y. Afeefy, Joel F. Liebman, and Stephen E. Stein
Quantity | Value | Units | Method | Reference | Comment |
---|---|---|---|---|---|
Tboil | 374.0 | K | N/A | Weast and Grasselli, 1989 | BS |
Tboil | 374.18 | K | N/A | Anonymous, 1951 | Uncertainty assigned by TRC = 0.3 K; TRC |
Tboil | 374.18 | K | N/A | Anonymous, 1951 | Uncertainty assigned by TRC = 0.3 K; TRC |
Tboil | 374.05 | K | N/A | Boord, Greenlee, et al., 1946 | Uncertainty assigned by TRC = 0.6 K; TRC |
Tboil | 374.65 | K | N/A | Boord, Greenlee, et al., 1945 | Uncertainty assigned by TRC = 1.5 K; TRC |
Quantity | Value | Units | Method | Reference | Comment |
ΔvapH° | 37.2 | kJ/mol | N/A | Reid, 1972 | AC |
ΔvapH° | 37.2 | kJ/mol | V | Camin and Rossini, 1960 | ALS |
Enthalpy of vaporization
ΔvapH (kJ/mol) | Temperature (K) | Method | Reference | Comment |
---|---|---|---|---|
36.1 | 321. | A | Stephenson and Malanowski, 1987 | Based on data from 306. to 379. K.; AC |
36.3 | 318. | MM | Camin and Rossini, 1960, 2 | Based on data from 303. to 374. K.; AC |

Kovats' RI, non-polar column, isothermal

Column type | Active phase | Temperature (C) | I | Reference | Comment |
---|---|---|---|---|---|
Capillary | Petrocol DH | 30. | 710.5 | Soják, Addová, et al., 2004 | 150. m/0.25 mm/1. μm, H2 |
Capillary | Squalane | 30. | 693.2 | Soják, Addová, et al., 2004 | He; Column length: 93. m; Column diameter: 0.25 mm |
Capillary | Squalane | 50. | 693. | Rijks and Cramers, 1974 | N2; Column length: 100. m; Column diameter: 0.25 mm |
Capillary | Squalane | 70. | 692. | Rijks and Cramers, 1974 | N2; Column length: 100. m; Column diameter: 0.25 mm |
Capillary | Squalane | 40. | 694. | Matukuma, 1969 | N2; Column length: 91.4 m; Column diameter: 0.25 mm |
Packed | Squalane | 30. | 693. | Tourres, 1967 | H2; Column length: 10. m |
Packed | Squalane | 50. | 693. | Tourres, 1967 | H2; Column length: 10. m |

Van Den Dool and Kratz RI, non-polar column, temperature ramp

Column type | Active phase | I | Reference | Comment |
---|---|---|---|---|
Capillary | Petrocol DH | 709. | White, Hackett, et al., 1992 | 100. m/0.25 mm/0.5 μm, He, 1. K/min; Tstart: 30. C; Tend: 220. C |

Normal alkane RI, non-polar column, temperature ramp

Column type | Active phase | I | Reference | Comment |
---|---|---|---|---|
Capillary | Petrocol DH | 710. | Supelco, 2012 | 100. m/0.25 mm/0.50 μm, Helium, 20. C @ 15. min, 15. K/min, 220. C @ 30. min |
Capillary | Petrocol DH | 710. | Supelco, 2012 | 100. m/0.25 mm/0.50 μm, Helium, 20. C @ 15. min, 15. K/min, 220. C @ 30. min |

References

Yates and McDonald, 1973
Yates, K.; McDonald, R.S.,
Kinetics and mechanisms of electrophilic addition. II. A thermochemical-kinetic approach to transition-state structure,
J. Org. Chem., 1973, 38, 2465-2478. [all data]
Yates and McDonald, 1971
Yates, K.; McDonald, R.S.,
A thermochemical probe into the mechanism of electrophilic addition to olefins,
J. Am. Chem. Soc., 1971, 93, 6297-6299. [all data]
Rockenfeller and Rossini, 1961
Rockenfeller, J.D.; Rossini, F.D.,
Heats of combustion, isomerization, and formation of selected C7, C8, and C10 monoolefin hydrocarbons,
J. Phys. Chem., 1961, 65, 267-272. [all data]
Weast and Grasselli, 1989
CRC Handbook of Data on Organic Compounds, 2nd Editon, Weast,R.C and Grasselli, J.G., ed(s)., CRC Press, Inc., Boca Raton, FL, 1989, 1. [all data]
Anonymous, 1951
Anonymous, R.,
, Sunbury Rep. No. 4199, Anglo-Iranian Oil Co., 1951. [all data]
Boord, Greenlee, et al., 1946
Boord, C.E.; Greenlee, K.W.; Perilstein, W.L.,
The Synthesis, Purification and Prop. of Hydrocarbons of Low Mol. Weight, Am. Pet. Inst. Res. Proj. 45, Eighth Annu. Rep., Ohio State Univ., June 30, 1946. [all data]
Boord, Greenlee, et al., 1945
Boord, C.E.; Greenlee, K.W.; Perilstein, W.L.,
, Am. Pet. Inst. Res. Proj. 45, Seventh Annu. Rep., Ohio State Univ., June 30, 1945. [all data]
Reid, 1972
Reid, Robert C.,
Handbook on vapor pressure and heats of vaporization of hydrocarbons and related compounds, R. C. Wilhort and B. J. Zwolinski, Texas A Research Foundation. College Station, Texas(1971). 329 pages.$10.00,
AIChE J., 1972, 18, 6, 1278-1278, https://doi.org/10.1002/aic.690180637
. [all data]
Camin and Rossini, 1960
Camin, D.L.; Rossini, F.D.,
Physical properties of to selected C7 and C8 alkene hydrocarbons,
J. Chem. Eng. Data, 1960, 5, 368. [all data]
Stephenson and Malanowski, 1987
Stephenson, Richard M.; Malanowski, Stanislaw,
Handbook of the Thermodynamics of Organic Compounds, 1987, https://doi.org/10.1007/978-94-009-3173-2
. [all data]
Camin and Rossini, 1960, 2
Camin, D.L.; Rossini, F.D.,
Physical Properties of 16 Selected C 7 and C 8 Alkene Hydrocarbons.,
J. Chem. Eng. Data, 1960, 5, 3, 368-372, https://doi.org/10.1021/je60007a037
. [all data]