bis(diisobutyldithiocarbamate)cadmium(II)

Phase change data

Data compiled by: William E. Acree, Jr., James S. Chickos

Quantity Value Units Method Reference Comment
Δsub281. ± 2.kJ/molDSC,Ede Souza, Pinheiro, et al., 1994

References

de Souza, Pinheiro, et al., 1994
de Souza, Antonio Gouveia; Pinheiro, Carlos Davidson; dos Santos, Luiz Carlos Ramos; de Medeiros Melo, Maria Lins, Standard enthalpy of formation of di-isobutyldithiocarbamate complexes of zinc-group elements and mean M-S bond-dissociation enthalpies, Thermochimica Acta, 1994, 231, 31-38, https://doi.org/10.1016/0040-6031(94)80004-9 . [all data]