Isoquinoline, 1-(phenylmethyl)-
- Formula: C16H13N
- Molecular weight: 219.2811
- IUPAC Standard InChIKey: IZTUINVRJSCOIR-UHFFFAOYSA-N
- CAS Registry Number: 6907-59-1
- Chemical structure:
View 3d structure (requires JavaScript / HTML 5) - Other names: Isoquinoline, 1-benzyl-; 1-Benzylisoquinoline

Phase change data

Data compiled by: Robert L. Brown and Stephen E. Stein
Quantity | Value | Units | Method | Reference | Comment |
---|---|---|---|---|---|
Tfus | 329. | K | N/A | Buckingham and Donaghy, 1982 |
Reduced pressure boiling point
Tboil (K) | Pressure (bar) | Reference |
---|---|---|
485.2 | 0.015 | Weast and Grasselli, 1989 |
484. to 486. | 0.015 | Buckingham and Donaghy, 1982 |
413. to 423. | 0.001 | Buckingham and Donaghy, 1982 |

References

Buckingham and Donaghy, 1982
Buckingham, J.; Donaghy, S.M.,
Dictionary of Organic Compounds: Fifth Edition, Chapman and Hall, New York, 1982, 1. [all data]
Weast and Grasselli, 1989
CRC Handbook of Data on Organic Compounds, 2nd Editon, Weast,R.C and Grasselli, J.G., ed(s)., CRC Press, Inc., Boca Raton, FL, 1989, 1. [all data]