CCl4+

Vibrational and/or electronic energy levels

Data compiled by: Marilyn E. Jacox

State:   D

 Energy
 (cm-1
 Med.   Transition   λmin
 (nm)
 λmax
 (nm)

References

Tx = 68800 ± 900 gas Potts, Lempka, et al., 1970
Smith, Tuckett, et al., 1993

State:   C

 Energy
 (cm-1
 Med.   Transition   λmin
 (nm)
 λmax
 (nm)

To = 39290 ± 900 gas Potts, Lempka, et al., 1970
Green, Green, et al., 1970
Bassett and Lloyd, 1971
Smith, Tuckett, et al., 1993

State:   B

 Energy
 (cm-1
 Med.   Transition   λmin
 (nm)
 λmax
 (nm)

Tx = 15330 ± 240 gas Potts, Lempka, et al., 1970
Green, Green, et al., 1970
Bassett and Lloyd, 1971
Golovin, Akopyan, et al., 1983

State:   A

 Energy
 (cm-1
 Med.   Transition   λmin
 (nm)
 λmax
 (nm)

To = 6450 ± 320 gas Potts, Lempka, et al., 1970
Green, Green, et al., 1970
Bassett and Lloyd, 1971
Golovin, Akopyan, et al., 1983

Additional references: Jacox, 1994, page 294; Jacox, 1998, page 305; Watanabe, 1957

Potts, Lempka, et al., 1970
Potts, A.W.; Lempka, H.J.; Streets, D.G.; Price, W.C., Photoelectron spectra of the halides of elements in groups III, IV, V and VI, Phil. Trans. Roy. Soc. (London), 1970, A268, 59. [all data]

Smith, Tuckett, et al., 1993
Smith, D.M.; Tuckett, R.P.; Yoxall, K.R.; Codling, K.; Hatherly, P.A., Fragmentation of the C 2T2 and D 2A1 states of CCl+4 and SiCl+4 studied by threshold photoelectron---photoion coincidence spectroscopy, Chem. Phys. Lett., 1993, 216, 3-6, 493, https://doi.org/10.1016/0009-2614(93)90133-L . [all data]

Green, Green, et al., 1970
Green, J.C.; Green, M.L.; Joachim, P.J.; Orchard, A.F.; Turner, D.W., A Study of the Bonding in the Group IV Tetrahalides by Photoelectron Spectroscopy, Phil. Trans. Roy. Soc. (London) A268, 1970, 268, 1184, 111, https://doi.org/10.1098/rsta.1970.0065 . [all data]

Bassett and Lloyd, 1971
Bassett, P.J.; Lloyd, D.R., J. Chem. Soc. A, 1971, 641. [all data]

Golovin, Akopyan, et al., 1983
Golovin, A.V.; Akopyan, M.E.; Sergeev, Y.L., Measurement of the kinetic energies of CCL3 + ions formed upon photoionization of carbon tetrachloride, Theor. Exper. Chem., 1983, 19, 3, 334, https://doi.org/10.1007/BF01146224 . [all data]

Jacox, 1994
Jacox, M.E., Vibrational and electronic energy levels of polyatomic transient molecules, American Chemical Society, Washington, DC, 1994, 464. [all data]

Jacox, 1998
Jacox, M.E., Vibrational and electronic energy levels of polyatomic transient molecules: supplement A, J. Phys. Chem. Ref. Data, 1998, 27, 2, 115-393, https://doi.org/10.1063/1.556017 . [all data]

Watanabe, 1957
Watanabe, K., Ionization potentials of some molecules, J. Chem. Phys., 1957, 26, 542. [all data]