DL-3,4-Di(1-cyclohexen-1-yl)-2,2,5,5-tetramethylhexane
- Formula: C22H38
- Molecular weight: 302.5371
- IUPAC Standard InChIKey: XIRWMTOAKDZMDH-UHFFFAOYSA-N
- CAS Registry Number: 69045-73-4
- Chemical structure:
View 3d structure (requires JavaScript / HTML 5) - Species with the same structure:

Gas phase thermochemistry data

Data compiled as indicated in comments:
ALS - Hussein Y. Afeefy, Joel F. Liebman, and Stephen E. Stein
Quantity | Value | Units | Method | Reference | Comment |
---|---|---|---|---|---|
ΔfH°gas | -211. | kJ/mol | Semi | Stewart, 2004 | |
ΔfH°gas | -260. ± 6.3 | kJ/mol | Cm | Herberg, Beckhaus, et al., 1993 | homolysis; ALS |

References

Stewart, 2004
Stewart, J.J.P.,
Comparison of the accuracy of semiempirical and some DFT methods for predicting heats of formation,
J. Mol. Model, 2004, 10, 1, 6-10, https://doi.org/10.1007/s00894-003-0157-6
. [all data]
Herberg, Beckhaus, et al., 1993
Herberg, C.; Beckhaus, H.-D.; Kortvelyesi, T.; Ruchardt, C.,
Thermolabile hydrocarbons. 32. Competing core rearrangement and homolytic decomposition of mego- and DL-3,4-di-cyclohexen-1-yl,2,2,5,5-tetramethylhexane,
Chem. Ber., 1993, 126, 117-127. [all data]