3,4,3',4'-Tetrachloro-bipyrrolyl-2,5,2',5'-tetraone
- Formula: C8Cl4N2O4
- Molecular weight: 329.909
- IUPAC Standard InChIKey: MLYGWVFFHZKDFI-UHFFFAOYSA-N
- CAS Registry Number: 6903-91-9
- Chemical structure:
View 3d structure (requires JavaScript / HTML 5) - Information on this page:

Reaction thermochemistry data

Data compiled by: Hussein Y. Afeefy, Joel F. Liebman, and Stephen E. Stein
Individual Reactions
+
= C28H14Cl4N2O5
By formula: C20H14O + C8Cl4N2O4 = C28H14Cl4N2O5
Quantity | Value | Units | Method | Reference | Comment |
---|---|---|---|---|---|
ΔrH° | -73.2 | kJ/mol | Cm | Adigezalov, Kiselev, et al., 1991 | liquid phase; solvent: Dioxane |

References

Adigezalov, Kiselev, et al., 1991
Adigezalov, N.R.; Kiselev, V.D.; Konovalov, A.I.,
Bis-reagents in Diels-Alder reactions. V. Kinetics and thermochemistry of reactions of N,N'-bis(dichloromaleimides) with 1,3-diphenylisobenzofuran,
Zh. Org. Khim., 1991, 27, 1774-1779. [all data]