Trifluoromethylthiocyanate

Phase change data

Data compiled by: William E. Acree, Jr., James S. Chickos

Enthalpy of vaporization

ΔvapH (kJ/mol) Temperature (K) Method Reference Comment
32.6279.AStephenson and Malanowski, 1987Based on data from 226. - 294. K. See also Dykyj, Svoboda, et al., 1999 and Emel«65533»us and Haas, 1963.

References

Stephenson and Malanowski, 1987
Stephenson, Richard M.; Malanowski, Stanislaw, Handbook of the Thermodynamics of Organic Compounds, 1987, https://doi.org/10.1007/978-94-009-3173-2 . [all data]

Dykyj, Svoboda, et al., 1999
Dykyj, J.; Svoboda, J.; Wilhoit, R.C.; Frenkel, M.L.; Hall, K.R., Vapor Pressure of Chemicals: Part A. Vapor Pressure and Antoine Constants for Hydrocarbons and Sulfur, Selenium, Tellurium and Hydrogen Containing Organic Compounds, Springer, Berlin, 1999, 373. [all data]

Emel«65533»us and Haas, 1963
Emel«65533»us, H.J.; Haas, A., 238. Trifluoromethanesulphenyl pseudohalides, J. Chem. Soc., 1963, 1272, https://doi.org/10.1039/jr9630001272 . [all data]