1,1,1-Trifluoroazomethane
- Formula: C2H3F3N2
- Molecular weight: 112.0538
- IUPAC Standard InChIKey: VAZQAOKQZRYCIN-VOTSOKGWSA-N
- CAS Registry Number: 690-21-1
- Chemical structure:
View 3d structure (requires JavaScript / HTML 5) - Permanent link for this species. Use this link for bookmarking this species for future reference.

Phase change data

Data compiled as indicated in comments:
TRC - Thermodynamics Research Center, NIST Boulder Laboratories, Chris Muzny director
AC - William E. Acree, Jr., James S. Chickos
Quantity | Value | Units | Method | Reference | Comment |
---|---|---|---|---|---|
Tboil | 321. | K | N/A | Filatov, Makarov, et al., 1968 | Uncertainty assigned by TRC = 3. K; TRC |
Enthalpy of vaporization
ΔvapH (kJ/mol) | Temperature (K) | Method | Reference | Comment |
---|---|---|---|---|
26.4 | 258. | A | Stephenson and Malanowski, 1987 | Based on data from 240. to 273. K.; AC |

References

Filatov, Makarov, et al., 1968
Filatov, A.S.; Makarov, S.P.; Yakubovich, A.Ya.,
Halogenation of 1,1,1-Trifluoroazomethane,
Zh. Obshch. Khim., 1968, 38, 33. [all data]
Stephenson and Malanowski, 1987
Stephenson, Richard M.; Malanowski, Stanislaw,
Handbook of the Thermodynamics of Organic Compounds, 1987, https://doi.org/10.1007/978-94-009-3173-2
. [all data]