L-Proline, 1-acetyl-
- Formula: C7H10NO3
- Molecular weight: 156.1592
- IUPAC Standard InChIKey: GNMSLDIYJOSUSW-ZCFIWIBFSA-N
- CAS Registry Number: 68-95-1
- Chemical structure:

Reaction thermochemistry data

Data compiled by: Robert C. Dunbar
Individual Reactions
By formula: Na+ + C7H10NO3 = (Na+ • C7H10NO3)
Free energy of reaction
ΔrG° (kcal/mol) | T (K) | Method | Reference |
---|---|---|---|
35.2 | 0. | CIDC | Feng, Gronert, et al., 1999 |

Ion clustering data

Data compiled by: Robert C. Dunbar
Clustering reactions
By formula: Na+ + C7H10NO3 = (Na+ • C7H10NO3)
Free energy of reaction
ΔrG° (kcal/mol) | T (K) | Method | Reference |
---|---|---|---|
35.2 | 0. | CIDC | Feng, Gronert, et al., 1999 |

References

Feng, Gronert, et al., 1999
Feng, W.Y.; Gronert, S.; Lebrilla, C.B.,
Lithium and sodium ion binding energies of N-acetyl and N-glycyl amino acids,
J. Am. Chem. Soc., 1999, 121, 6, 1365, https://doi.org/10.1021/ja983116s
. [all data]